{"text_format":"1","workbook":"xlsx","n_sheets":6,"sheets":["SABİT_BİLGİLER","ANASAYFA","TARİH_GÜN_SEÇİMİ","ELLE_TATİL_GİR!","ÇİZELGE","FORMÜL"],"not_rendered":{"charts":0,"images":3,"macros":1,"external_links":0,"defined_names":5,"comments":1,"pivot_tables":0},"unopened":[],"bounds":{"document_bytes":16777216,"sheet_cells":100000,"rows_first":2000,"rows_last":500,"rows_between":2000,"halvings":0,"cell_chars":16384,"cell_head_chars":4096},"cells_cut":0,"cells_raw":0,"read":"whole","date_system":"1900"}

{"sheet":"SABİT_BİLGİLER","index":0,"n_rows":17,"n_cols":33,"rows_kept":17,"cut":false,"hidden":false,"merged":[[13,24,14,31],[13,32,14,42],[16,32,16,42],[16,24,16,31],[11,24,11,42],[15,32,15,42],[15,24,15,31],[7,2,7,9],[7,10,7,20],[14,10,14,20],[15,10,15,20],[16,10,16,20],[11,2,11,20],[14,2,14,3],[15,2,15,3],[16,2,16,3],[14,4,14,9],[15,4,15,9],[16,4,16,9],[13,2,13,3],[13,4,13,9],[13,10,13,20],[5,24,6,31],[5,32,6,42],[2,2,2,20],[4,2,4,9],[4,10,4,20],[5,2,5,9],[5,10,5,20],[6,2,6,9],[6,10,6,20]]}
[]
[]
[null,null,"TYÇ BİLGİLERİ"]
[]
[null,null,"TYP NO",null,null,null,null,null,null,null,"-"]
[null,null,"TYP BAŞLAMA TARİHİ",null,null,null,null,null,null,null,"2022-09-05",null,null,null,null,null,null,null,null,null,null,null,null,null,"TATİLLER İÇİN İŞARET GİR!",null,null,null,null,null,null,null,"XXXX"]
[null,null,"TYP BİTİŞ TARİHİ",null,null,null,null,null,null,null,"… / 06 / 2023"]
[null,null,"TYP KONUSU",null,null,null,null,null,null,null,"TYP Kursiyerleri"]
[]
[]
[]
[null,null,"KURSİYER BİLGİ GİRİŞİ",null,null,null,null,null,null,null,null,null,null,null,null,null,null,null,null,null,null,null,null,null,"OKUL BİLGİLERİ GİRİŞİ"]
[]
[null,null,"S.N.",null,"TC KİMLİK NO",null,null,null,null,null,"ADI VE SOYADI",null,null,null,null,null,null,null,null,null,null,null,null,null,"OKUL ADI"]
[null,null,1]
[null,null,2,null,null,null,null,null,null,null,null,null,null,null,null,null,null,null,null,null,null,null,null,null,"YETKİLİ ADI VE SOYADI"]
[null,null,3,null,null,null,null,null,null,null,null,null,null,null,null,null,null,null,null,null,null,null,null,null,"YETKİLİ ÜNVANI"]

{"sheet":"ANASAYFA","index":1,"n_rows":7,"n_cols":22,"rows_kept":7,"cut":false,"hidden":false,"merged":[[3,10,4,12],[6,10,7,12],[2,8,8,8],[1,21,1,37],[2,21,13,37],[13,14,13,18],[3,13,4,17],[6,13,7,17]]}
[]
[null,null,null,null,null,null,null,null,null,null,null,null,null,null,null,null,null,null,null,null,null,"AÇIKLAMA"]
[null,null,null,null,null,null,null,null,"MEVCUT AY SEÇİMİ",null,null,null,null,null,null,null,null,null,null,null,null,"Bu program Malatya ÇALIŞMA VE İŞ KURUMU Müdürlüğü tarafından okullarda çalıştırılan Personelin takibi amacıyla hazırlanmıştır. Programın kullanımı çok basit olup aşağıdaki özelliklere sahiptir:\n² Personel Bazlı Tatil Girme\n² Tüm Personel İçin Ortak Tatil Girme\n²Çalışma Günü Belirleme\n² Eğitim Günü Seçimi\n\nProgramda görülen hatalar için lütfen abdulhekimuckac@gmail.com veya befozum@gmail.com\nadresine mail atınız."]
[null,null,null,null,null,null,null,null,null,null,"YIL SEÇ!"]
[]
[]
[null,null,null,null,null,null,null,null,null,null,"AY SEÇ!"]

{"sheet":"TARİH_GÜN_SEÇİMİ","index":2,"n_rows":59,"n_cols":64,"rows_kept":59,"cut":false,"hidden":false,"merged":[[17,29,22,36],[17,50,22,56],[18,4,18,11],[19,4,19,11],[20,4,20,11],[21,4,21,11],[17,15,17,22],[18,15,18,22],[19,15,19,22],[20,15,20,22],[17,4,17,11],[4,2,4,22],[12,15,12,22],[13,15,13,22],[14,15,14,22],[15,15,15,22],[6,15,6,22],[6,4,6,11],[7,4,7,11],[8,4,8,11],[9,4,9,11],[10,4,10,11],[16,15,16,22],[11,4,11,11],[7,15,7,22],[8,15,8,22],[9,15,9,22],[10,15,10,22],[11,15,11,22],[16,4,16,11],[12,4,12,11],[13,4,13,11],[14,4,14,11],[15,4,15,11],[15,30,15,33],[6,34,8,34],[6,35,8,35],[6,30,8,33],[9,30,9,33],[10,30,10,33],[11,30,11,33],[12,30,12,33],[13,30,13,33],[4,30,4,35],[4,51,4,55],[6,51,8,54],[6,55,8,55],[14,30,14,33],[14,51,14,54],[15,51,15,54],[9,51,9,54],[10,51,10,54],[11,51,11,54],[12,51,12,54],[13,51,13,54]]}
[]
[]
[]
[null,null,null,null,null,null,null,null,null,null,null,null,null,null,null,null,null,null,null,null,null,null,null,null,true,false]
[null,null,"ELLE TATİL GÜNÜ GİR!",null,null,null,null,null,null,null,null,null,null,null,null,null,null,null,null,null,null,null,null,null,null,null,null,null,null,null,"ÇALIŞMA GÜNÜ SEÇ!",null,null,null,null,null,null,null,null,null,null,null,null,null,null,null,null,null,null,null,null,"EĞİTİM GÜNÜ SEÇ!"]
[]
[null,null,1,null,{"$f":"IF(Y7=$Y$4,\"TATİL\",IF(FORMÜL!L4=\"\",\"\",FORMÜL!L4))","v":"2022-02-01"},null,null,null,null,null,null,null,null,17,null,{"$f":"IF(Z7=$Y$4,\"TATİL\",IF(FORMÜL!L20=\"\",\"\",FORMÜL!L20))","v":"2022-02-17"},null,null,null,null,null,null,null,null,null,null,null,null,null,null,"GÜNLER",null,null,null,"SABAH","AKŞAM",null,null,null,null,null,null,null,null,null,null,null,null,null,null,null,"GÜNLER",null,null,null,"EĞİTİM\nVAR"]
[null,null,2,null,{"$f":"IF(Y8=$Y$4,\"TATİL\",IF(FORMÜL!L5=\"\",\"\",FORMÜL!L5))","v":"2022-02-02"},null,null,null,null,null,null,null,null,18,null,{"$f":"IF(Z8=$Y$4,\"TATİL\",IF(FORMÜL!L21=\"\",\"\",FORMÜL!L21))","v":"2022-02-18"},null,null,null,null,null,null,null,null,null,null,null,null,null,null,null,null,null,null,null,null,null,null,true,true,null,null,null,null,null,null,null,null,null,null,null,null,null,null,null,null,null,null,true]
[null,null,3,null,{"$f":"IF(Y9=$Y$4,\"TATİL\",IF(FORMÜL!L6=\"\",\"\",FORMÜL!L6))","v":"2022-02-03"},null,null,null,null,null,null,null,null,19,null,{"$f":"IF(Z9=$Y$4,\"TATİL\",IF(FORMÜL!L22=\"\",\"\",FORMÜL!L22))","v":"2022-02-19"}]
[null,null,4,null,{"$f":"IF(Y10=$Y$4,\"TATİL\",IF(FORMÜL!L7=\"\",\"\",FORMÜL!L7))","v":"2022-02-04"},null,null,null,null,null,null,null,null,20,null,{"$f":"IF(Z10=$Y$4,\"TATİL\",IF(FORMÜL!L23=\"\",\"\",FORMÜL!L23))","v":"2022-02-20"},null,null,null,null,null,null,null,null,null,null,null,null,null,null,"PAZARTESİ",null,null,null,null,null,null,null,true,true,null,1,"PAZARTESİ",{"$f":"IF(AM10=$AM$8,0,1)","v":0},{"$f":"IF(AN10=$AN$8,0,1)","v":0},{"$f":"AR10+AS10","v":0},null,null,null,null,null,"PAZARTESİ",null,null,null,null,null,null,false,null,null,1,"PAZARTESİ",{"$f":"IF(BG10=$BG$8,0,1)","v":1}]
[null,null,5,null,{"$f":"IF(Y11=$Y$4,\"TATİL\",IF(FORMÜL!L8=\"\",\"\",FORMÜL!L8))","v":"2022-02-05"},null,null,null,null,null,null,null,null,21,null,{"$f":"IF(Z11=$Y$4,\"TATİL\",IF(FORMÜL!L24=\"\",\"\",FORMÜL!L24))","v":"2022-02-21"},null,null,null,null,null,null,null,null,null,null,null,null,null,null,"SALI",null,null,null,null,null,null,null,true,true,null,2,"SALI",0,0,{"$f":"AR11+AS11","v":0},null,null,null,null,null,"SALI",null,null,null,null,null,null,false,null,null,2,"SALI",{"$f":"IF(BG11=$BG$8,0,1)","v":1}]
[null,null,6,null,{"$f":"IF(Y12=$Y$4,\"TATİL\",IF(FORMÜL!L9=\"\",\"\",FORMÜL!L9))","v":"2022-02-06"},null,null,null,null,null,null,null,null,22,null,{"$f":"IF(Z12=$Y$4,\"TATİL\",IF(FORMÜL!L25=\"\",\"\",FORMÜL!L25))","v":"2022-02-22"},null,null,null,null,null,null,null,null,null,null,null,null,null,null,"ÇARŞAMBA",null,null,null,null,null,null,null,true,true,null,3,"ÇARŞAMBA",0,0,0,null,null,null,null,null,"ÇARŞAMBA",null,null,null,null,null,null,true,null,null,3,"ÇARŞAMBA",0]
[null,null,7,null,{"$f":"IF(Y13=$Y$4,\"TATİL\",IF(FORMÜL!L10=\"\",\"\",FORMÜL!L10))","v":"2022-02-07"},null,null,null,null,null,null,null,null,23,null,{"$f":"IF(Z13=$Y$4,\"TATİL\",IF(FORMÜL!L26=\"\",\"\",FORMÜL!L26))","v":"2022-02-23"},null,null,null,null,null,null,null,null,null,null,null,null,null,null,"PERŞEMBE",null,null,null,null,null,null,null,true,true,null,4,"PERŞEMBE",0,0,0,null,null,null,null,null,"PERŞEMBE",null,null,null,null,null,null,false,null,null,4,"PERŞEMBE",1]
[null,null,8,null,{"$f":"IF(Y14=$Y$4,\"TATİL\",IF(FORMÜL!L11=\"\",\"\",FORMÜL!L11))","v":"2022-02-08"},null,null,null,null,null,null,null,null,24,null,{"$f":"IF(Z14=$Y$4,\"TATİL\",IF(FORMÜL!L27=\"\",\"\",FORMÜL!L27))","v":"2022-02-24"},null,null,null,null,null,null,null,null,null,null,null,null,null,null,"CUMA",null,null,null,null,null,null,null,true,true,null,5,"CUMA",0,0,0,null,null,null,null,null,"CUMA",null,null,null,null,null,null,false,null,null,5,"CUMA",1]
[null,null,9,null,{"$f":"IF(Y15=$Y$4,\"TATİL\",IF(FORMÜL!L12=\"\",\"\",FORMÜL!L12))","v":"2022-02-09"},null,null,null,null,null,null,null,null,25,null,{"$f":"IF(Z15=$Y$4,\"TATİL\",IF(FORMÜL!L28=\"\",\"\",FORMÜL!L28))","v":"2022-02-25"},null,null,null,null,null,null,null,null,null,null,null,null,null,null,"CUMARTESİ",null,null,null,null,null,null,null,false,false,null,6,"CUMARTESI",1,1,2,null,null,null,null,null,"CUMARTESİ",null,null,null,null,null,null,false,null,null,6,"CUMARTESI",1]
[null,null,10,null,{"$f":"IF(Y16=$Y$4,\"TATİL\",IF(FORMÜL!L13=\"\",\"\",FORMÜL!L13))","v":"2022-02-10"},null,null,null,null,null,null,null,null,26,null,{"$f":"IF(Z16=$Y$4,\"TATİL\",IF(FORMÜL!L29=\"\",\"\",FORMÜL!L29))","v":"2022-02-26"},null,null,null,null,null,null,null,null,null,null,null,null,null,null,"PAZAR",null,null,null,null,null,null,null,false,false,null,7,"PAZAR",1,1,2,null,null,null,null,null,"PAZARTESİ",null,null,null,null,null,null,false,null,null,7,"PAZAR",1]
[null,null,11,null,{"$f":"IF(Y17=$Y$4,\"TATİL\",IF(FORMÜL!L14=\"\",\"\",FORMÜL!L14))","v":"2022-02-11"},null,null,null,null,null,null,null,null,27,null,{"$f":"IF(Z17=$Y$4,\"TATİL\",IF(FORMÜL!L30=\"\",\"\",FORMÜL!L30))","v":"2022-02-27"}]
[null,null,12,null,{"$f":"IF(Y18=$Y$4,\"TATİL\",IF(FORMÜL!L15=\"\",\"\",FORMÜL!L15))","v":"2022-02-12"},null,null,null,null,null,null,null,null,28,null,{"$f":"IF(Z18=$Y$4,\"TATİL\",IF(FORMÜL!L31=\"\",\"\",FORMÜL!L31))","v":"2022-02-28"},null,null,null,null,null,null,null,null,null,null,null,null,null,"Yukarıdaki günlerden hangisinde çalışma olacaksa ve hangi bölümler imzalanacaksa işaretleyiniz. Çalışma olmayan günleri boş bırakınız!",null,null,null,null,null,null,null,null,null,null,null,null,null,null,null,null,null,null,null,null,"Yukarıdaki günlerden hangisinde EĞİTİM imzası atılacaksa o günü işaretleyiniz. Birden fazla gün işaretleyebilirsiniz."]
[null,null,13,null,{"$f":"IF(Y19=$Y$4,\"TATİL\",IF(FORMÜL!L16=\"\",\"\",FORMÜL!L16))","v":"2022-02-13"},null,null,null,null,null,null,null,null,29,null,{"$f":"IF(Z19=$Y$4,\"TATİL\",IF(FORMÜL!L32=\"\",\"\",FORMÜL!L32))","v":""}]
[null,null,14,null,{"$f":"IF(Y20=$Y$4,\"TATİL\",IF(FORMÜL!L17=\"\",\"\",FORMÜL!L17))","v":"2022-02-14"},null,null,null,null,null,null,null,null,30,null,{"$f":"IF(Z20=$Y$4,\"TATİL\",IF(FORMÜL!L33=\"\",\"\",FORMÜL!L33))","v":""}]
[null,null,15,null,{"$f":"IF(Y21=$Y$4,\"TATİL\",IF(FORMÜL!L18=\"\",\"\",FORMÜL!L18))","v":"2022-02-15"},null,null,null,null,null,null,null,null,31,null,{"$f":"IF(Z21=$Y$4,\"TATİL\",IF(FORMÜL!L34=\"\",\"\",FORMÜL!L34))","v":""}]
[null,null,16,null,{"$f":"IF(Y22=$Y$4,\"TATİL\",IF(FORMÜL!L19=\"\",\"\",FORMÜL!L19))","v":"2022-02-16"}]
[]
[]
[]
[]
[]
[]
[null,null,null,null,null,null,null,null,null,null,null,null,null,null,null,null,null,null,null,null,null,null,null,null,{"$f":"IF(Y7=$Y$4,1,0)","v":0}]
[null,null,null,null,null,null,null,null,null,null,null,null,null,null,null,null,null,null,null,null,null,null,null,null,{"$f":"IF(Y8=$Y$4,1,0)","v":0}]
[null,null,null,null,null,null,null,null,null,null,null,null,null,null,null,null,null,null,null,null,null,null,null,null,0]
[null,null,null,null,null,null,null,null,null,null,null,null,null,null,null,null,null,null,null,null,null,null,null,null,0]
[null,null,null,null,null,null,null,null,null,null,null,null,null,null,null,null,null,null,null,null,null,null,null,null,0]
[null,null,null,null,null,null,null,null,null,null,null,null,null,null,null,null,null,null,null,null,null,null,null,null,0]
[null,null,null,null,null,null,null,null,null,null,null,null,null,null,null,null,null,null,null,null,null,null,null,null,0]
[null,null,null,null,null,null,null,null,null,null,null,null,null,null,null,null,null,null,null,null,null,null,null,null,0]
[null,null,null,null,null,null,null,null,null,null,null,null,null,null,null,null,null,null,null,null,null,null,null,null,0]
[null,null,null,null,null,null,null,null,null,null,null,null,null,null,null,null,null,null,null,null,null,null,null,null,0]
[null,null,null,null,null,null,null,null,null,null,null,null,null,null,null,null,null,null,null,null,null,null,null,null,0]
[null,null,null,null,null,null,null,null,null,null,null,null,null,null,null,null,null,null,null,null,null,null,null,null,0]
[null,null,null,null,null,null,null,null,null,null,null,null,null,null,null,null,null,null,null,null,null,null,null,null,0]
[null,null,null,null,null,null,null,null,null,null,null,null,null,null,null,null,null,null,null,null,null,null,null,null,0]
[null,null,null,null,null,null,null,null,null,null,null,null,null,null,null,null,null,null,null,null,null,null,null,null,0]
[null,null,null,null,null,null,null,null,null,null,null,null,null,null,null,null,null,null,null,null,null,null,null,null,0]
[null,null,null,null,null,null,null,null,null,null,null,null,null,null,null,null,null,null,null,null,null,null,null,null,{"$f":"IF(Z7=$Y$4,1,0)","v":0}]
[null,null,null,null,null,null,null,null,null,null,null,null,null,null,null,null,null,null,null,null,null,null,null,null,{"$f":"IF(Z8=$Y$4,1,0)","v":0}]
[null,null,null,null,null,null,null,null,null,null,null,null,null,null,null,null,null,null,null,null,null,null,null,null,0]
[null,null,null,null,null,null,null,null,null,null,null,null,null,null,null,null,null,null,null,null,null,null,null,null,0]
[null,null,null,null,null,null,null,null,null,null,null,null,null,null,null,null,null,null,null,null,null,null,null,null,0]
[null,null,null,null,null,null,null,null,null,null,null,null,null,null,null,null,null,null,null,null,null,null,null,null,0]
[null,null,null,null,null,null,null,null,null,null,null,null,null,null,null,null,null,null,null,null,null,null,null,null,0]
[null,null,null,null,null,null,null,null,null,null,null,null,null,null,null,null,null,null,null,null,null,null,null,null,0]
[null,null,null,null,null,null,null,null,null,null,null,null,null,null,null,null,null,null,null,null,null,null,null,null,0]
[null,null,null,null,null,null,null,null,null,null,null,null,null,null,null,null,null,null,null,null,null,null,null,null,0]
[null,null,null,null,null,null,null,null,null,null,null,null,null,null,null,null,null,null,null,null,null,null,null,null,0]
[null,null,null,null,null,null,null,null,null,null,null,null,null,null,null,null,null,null,null,null,null,null,null,null,0]
[null,null,null,null,null,null,null,null,null,null,null,null,null,null,null,null,null,null,null,null,null,null,null,null,0]
[null,null,null,null,null,null,null,null,null,null,null,null,null,null,null,null,null,null,null,null,null,null,null,null,0]
[null,null,null,null,null,null,null,null,null,null,null,null,null,null,null,null,null,null,null,null,null,null,null,null,0]

{"sheet":"ELLE_TATİL_GİR!","index":3,"n_rows":34,"n_cols":18,"rows_kept":34,"cut":false,"hidden":false,"merged":[[4,9,18,9],[2,1,2,2],[2,4,2,5],[2,7,2,8],[1,1,1,2],[1,4,1,5],[1,7,1,8]]}
[null,null,null,null,null,null,null,null,null,null,null,false]
[null,{"$f":"IF(SABİT_BİLGİLER!E15=\"\",\"XXXXXXXXXXXXXXX\",SABİT_BİLGİLER!E15)","v":"XXXXXXXXXXXXXXX"},null,null,{"$f":"IF(SABİT_BİLGİLER!E16=\"\",\"XXXXXXXXXXXXXXX\",SABİT_BİLGİLER!E16)","v":"XXXXXXXXXXXXXXX"},null,null,{"$f":"IF(SABİT_BİLGİLER!E17=\"\",\"XXXXXXXXXXXXXXX\",SABİT_BİLGİLER!E17)","v":"XXXXXXXXXXXXXXX"}]
[null,{"$f":"IF(SABİT_BİLGİLER!K15=\"\",\"XXXXXXXXXXXXXXX\",SABİT_BİLGİLER!K15)","v":"XXXXXXXXXXXXXXX"},null,null,{"$f":"IF(SABİT_BİLGİLER!K16=\"\",\"XXXXXXXXXXXXXXX\",SABİT_BİLGİLER!K16)","v":"XXXXXXXXXXXXXXX"},null,null,{"$f":"IF(SABİT_BİLGİLER!K17=\"\",\"XXXXXXXXXXXXXXX\",SABİT_BİLGİLER!K17)","v":"XXXXXXXXXXXXXXX"}]
[null,"01",null,null,"01",null,null,"01",null,null,null,null,null,null,null,{"$f":"IF(K4=$L$1,0,1)","v":0},{"$f":"IF(L4=$L$1,0,1)","v":0},{"$f":"IF(M4=$L$1,0,1)","v":0}]
[null,"02",null,null,"02",null,null,"02",null,"Kişisel Tatil Girişi Yapmak İçin İlgili Kişinin İsminin Altındaki Kutucukları İşaretleyebilirsiniz.\n-----------------------------------------------------------\nKişilerin İsminin Üstündeki \"SIFIRLA!\" Butonuna Basarsanız İlgili Kişinin Tatil Bilgilerini Kaldırır.",null,null,null,null,null,{"$f":"IF(K5=$L$1,0,1)","v":0},{"$f":"IF(L5=$L$1,0,1)","v":0},{"$f":"IF(M5=$L$1,0,1)","v":0}]
[null,"03",null,null,"03",null,null,"03",null,null,null,null,null,null,null,0,0,0]
[null,"04",null,null,"04",null,null,"04",null,null,null,null,null,null,null,0,0,0]
[null,"05",null,null,"05",null,null,"05",null,null,null,null,null,null,null,0,0,0]
[null,"06",null,null,"06",null,null,"06",null,null,null,null,null,null,null,0,0,0]
[null,"07",null,null,"07",null,null,"07",null,null,null,null,null,null,null,0,0,0]
[null,"08",null,null,"08",null,null,"08",null,null,null,null,null,null,null,0,0,0]
[null,"09",null,null,"09",null,null,"09",null,null,null,null,null,null,null,0,0,0]
[null,"10",null,null,"10",null,null,"10",null,null,null,null,null,null,null,0,0,0]
[null,"11",null,null,"11",null,null,"11",null,null,null,null,null,null,null,0,0,0]
[null,"12",null,null,"12",null,null,"12",null,null,null,null,null,null,null,0,0,0]
[null,"13",null,null,"13",null,null,"13",null,null,null,null,null,null,null,0,0,0]
[null,"14",null,null,"14",null,null,"14",null,null,null,null,null,null,null,0,0,0]
[null,"15",null,null,"15",null,null,"15",null,null,null,null,null,null,null,0,0,0]
[null,"16",null,null,"16",null,null,"16",null,null,null,null,null,null,null,0,0,0]
[null,"17",null,null,"17",null,null,"17",null,null,null,null,null,null,null,0,0,0]
[null,"18",null,null,"18",null,null,"18",null,null,null,null,null,null,null,0,0,0]
[null,"19",null,null,"19",null,null,"19",null,null,null,null,null,null,null,0,0,0]
[null,"20",null,null,"20",null,null,"20",null,null,null,null,null,null,null,0,0,0]
[null,"21",null,null,"21",null,null,"21",null,null,null,null,null,null,null,0,0,0]
[null,"22",null,null,"22",null,null,"22",null,null,null,null,null,null,null,0,0,0]
[null,"23",null,null,"23",null,null,"23",null,null,null,null,null,null,null,0,0,0]
[null,"24",null,null,"24",null,null,"24",null,null,null,null,null,null,null,0,0,0]
[null,"25",null,null,"25",null,null,"25",null,null,null,null,null,null,null,0,0,0]
[null,"26",null,null,"26",null,null,"26",null,null,null,null,null,null,null,0,0,0]
[null,"27",null,null,"27",null,null,"27",null,null,null,null,null,null,null,0,0,0]
[null,"28",null,null,"28",null,null,"28",null,null,null,null,null,null,null,0,0,0]
[null,"29",null,null,"29",null,null,"29",null,null,null,null,null,null,null,0,0,0]
[null,"30",null,null,"30",null,null,"30",null,null,null,null,null,null,null,0,0,0]
[null,"31",null,null,"31",null,null,"31",null,null,null,null,null,null,null,0,0,0]

{"sheet":"ÇİZELGE","index":4,"n_rows":47,"n_cols":40,"rows_kept":47,"cut":false,"hidden":false,"merged":[[46,0,46,41],[44,22,44,24],[44,25,44,27],[44,29,44,32],[44,33,44,35],[44,36,44,38],[44,39,44,41],[44,0,44,3],[44,4,44,6],[44,7,44,9],[44,10,44,12],[44,15,44,18],[44,19,44,21],[43,22,43,24],[43,25,43,27],[43,29,43,32],[43,33,43,35],[43,36,43,38],[43,39,43,41],[43,0,43,3],[43,4,43,6],[43,7,43,9],[43,10,43,12],[43,15,43,18],[43,19,43,21],[42,22,42,24],[42,25,42,27],[42,29,42,32],[42,33,42,35],[42,36,42,38],[42,39,42,41],[42,0,42,3],[42,4,42,6],[42,7,42,9],[42,10,42,12],[42,15,42,18],[42,19,42,21],[41,22,41,24],[41,25,41,27],[41,29,41,32],[41,33,41,35],[41,36,41,38],[41,39,41,41],[41,0,41,3],[41,4,41,6],[41,7,41,9],[41,10,41,12],[41,15,41,18],[41,19,41,21],[40,22,40,24],[40,25,40,27],[40,29,40,32],[40,33,40,35],[40,36,40,38],[40,39,40,41],[40,0,40,3],[40,4,40,6],[40,7,40,9],[40,10,40,12],[40,15,40,18],[40,19,40,21],[39,22,39,24],[39,25,39,27],[39,29,39,32],[39,33,39,35],[39,36,39,38],[39,39,39,41],[39,0,39,3],[39,4,39,6],[39,7,39,9],[39,10,39,12],[39,15,39,18],[39,19,39,21],[38,22,38,24],[38,25,38,27],[38,29,38,32],[38,33,38,35],[38,36,38,38],[38,39,38,41],[38,0,38,3],[38,4,38,6],[38,7,38,9],[38,10,38,12],[38,15,38,18],[38,19,38,21],[37,22,37,24],[37,25,37,27],[37,29,37,32],[37,33,37,35],[37,36,37,38],[37,39,37,41],[37,0,37,3],[37,4,37,6],[37,7,37,9],[37,10,37,12],[37,15,37,18],[37,19,37,21],[36,22,36,24],[36,25,36,27],[36,29,36,32],[36,33,36,35],[36,36,36,38],[36,39,36,41],[36,0,36,3],[36,4,36,6],[36,7,36,9],[36,10,36,12],[36,15,36,18],[36,19,36,21],[35,22,35,24],[35,25,35,27],[35,29,35,32],[35,33,35,35],[35,36,35,38],[35,39,35,41],[35,0,35,3],[35,4,35,6],[35,7,35,9],[35,10,35,12],[35,15,35,18],[35,19,35,21],[34,22,34,24],[34,25,34,27],[34,29,34,32],[34,33,34,35],[34,36,34,38],[34,39,34,41],[34,0,34,3],[34,4,34,6],[34,7,34,9],[34,10,34,12],[34,15,34,18],[34,19,34,21],[33,22,33,24],[33,25,33,27],[33,29,33,32],[33,33,33,35],[33,36,33,38],[33,39,33,41],[33,0,33,3],[33,4,33,6],[33,7,33,9],[33,10,33,12],[33,15,33,18],[33,19,33,21],[32,22,32,24],[32,25,32,27],[32,29,32,32],[32,33,32,35],[32,36,32,38],[32,39,32,41],[32,0,32,3],[32,4,32,6],[32,7,32,9],[32,10,32,12],[32,15,32,18],[32,19,32,21],[31,22,31,24],[31,25,31,27],[31,29,31,32],[31,33,31,35],[31,36,31,38],[31,39,31,41],[31,0,31,3],[31,4,31,6],[31,7,31,9],[31,10,31,12],[31,15,31,18],[31,19,31,21],[30,22,30,24],[30,25,30,27],[30,29,30,32],[30,33,30,35],[30,36,30,38],[30,39,30,41],[30,0,30,3],[30,4,30,6],[30,7,30,9],[30,10,30,12],[30,15,30,18],[30,19,30,21],[29,22,29,24],[29,25,29,27],[29,29,29,32],[29,33,29,35],[29,36,29,38],[29,39,29,41],[29,0,29,3],[29,4,29,6],[29,7,29,9],[29,10,29,12],[29,15,29,18],[29,19,29,21],[28,22,28,24],[28,25,28,27],[28,29,28,32],[28,33,28,35],[28,36,28,38],[28,39,28,41],[28,0,28,3],[28,4,28,6],[28,7,28,9],[28,10,28,12],[28,15,28,18],[28,19,28,21],[27,22,27,24],[27,25,27,27],[27,29,27,32],[27,33,27,35],[27,36,27,38],[27,39,27,41],[27,0,27,3],[27,4,27,6],[27,7,27,9],[27,10,27,12],[27,15,27,18],[27,19,27,21],[26,22,26,24],[26,25,26,27],[26,29,26,32],[26,33,26,35],[26,36,26,38],[26,39,26,41],[26,0,26,3],[26,4,26,6],[26,7,26,9],[26,10,26,12],[26,15,26,18],[26,19,26,21],[25,22,25,24],[25,25,25,27],[25,29,25,32],[25,33,25,35],[25,36,25,38],[25,39,25,41],[25,0,25,3],[25,4,25,6],[25,7,25,9],[25,10,25,12],[25,15,25,18],[25,19,25,21],[24,22,24,24],[24,25,24,27],[24,29,24,32],[24,33,24,35],[24,36,24,38],[24,39,24,41],[24,0,24,3],[24,4,24,6],[24,7,24,9],[24,10,24,12],[24,15,24,18],[24,19,24,21],[23,22,23,24],[23,25,23,27],[23,29,23,32],[23,33,23,35],[23,36,23,38],[23,39,23,41],[23,0,23,3],[23,4,23,6],[23,7,23,9],[23,10,23,12],[23,15,23,18],[23,19,23,21],[22,22,22,24],[22,25,22,27],[22,29,22,32],[22,33,22,35],[22,36,22,38],[22,39,22,41],[22,0,22,3],[22,4,22,6],[22,7,22,9],[22,10,22,12],[22,15,22,18],[22,19,22,21],[21,22,21,24],[21,25,21,27],[21,29,21,32],[21,33,21,35],[21,36,21,38],[21,39,21,41],[21,0,21,3],[21,4,21,6],[21,7,21,9],[21,10,21,12],[21,15,21,18],[21,19,21,21],[20,22,20,24],[20,25,20,27],[20,29,20,32],[20,33,20,35],[20,36,20,38],[20,39,20,41],[20,0,20,3],[20,4,20,6],[20,7,20,9],[20,10,20,12],[20,15,20,18],[20,19,20,21],[19,22,19,24],[19,25,19,27],[19,29,19,32],[19,33,19,35],[19,36,19,38],[19,39,19,41],[19,0,19,3],[19,4,19,6],[19,7,19,9],[19,10,19,12],[19,15,19,18],[19,19,19,21],[18,22,18,24],[18,25,18,27],[18,29,18,32],[18,33,18,35],[18,36,18,38],[18,39,18,41],[18,0,18,3],[18,4,18,6],[18,7,18,9],[18,10,18,12],[18,15,18,18],[18,19,18,21],[17,22,17,24],[17,25,17,27],[17,29,17,32],[17,33,17,35],[17,36,17,38],[17,39,17,41],[17,0,17,3],[17,4,17,6],[17,7,17,9],[17,10,17,12],[17,15,17,18],[17,19,17,21],[16,22,16,24],[16,25,16,27],[16,29,16,32],[16,33,16,35],[16,36,16,38],[16,39,16,41],[16,0,16,3],[16,4,16,6],[16,7,16,9],[16,10,16,12],[16,15,16,18],[16,19,16,21],[15,22,15,24],[15,25,15,27],[15,29,15,32],[15,33,15,35],[15,36,15,38],[15,39,15,41],[15,0,15,3],[15,4,15,6],[15,7,15,9],[15,10,15,12],[15,15,15,18],[15,19,15,21],[14,22,14,24],[14,25,14,27],[14,29,14,32],[14,33,14,35],[14,36,14,38],[14,39,14,41],[14,0,14,3],[14,4,14,6],[14,7,14,9],[14,10,14,12],[14,15,14,18],[14,19,14,21],[13,22,13,24],[13,25,13,27],[13,29,13,32],[13,33,13,35],[13,36,13,38],[13,39,13,41],[13,0,13,3],[13,4,13,6],[13,7,13,9],[13,10,13,12],[13,15,13,18],[13,19,13,21],[12,0,12,3],[12,4,12,12],[12,15,12,18],[12,19,12,27],[12,29,12,32],[12,33,12,41],[11,0,11,3],[11,4,11,12],[11,15,11,18],[11,19,11,27],[11,29,11,32],[11,33,11,41],[0,9,0,35],[1,12,1,31],[2,8,2,35],[3,0,3,41],[5,0,5,5],[5,6,5,22],[5,23,5,27],[5,28,5,41],[8,0,9,5],[8,6,9,22],[8,23,9,27],[8,28,8,38],[8,39,9,41],[9,28,9,38],[6,0,6,5],[6,6,6,22],[6,23,6,27],[6,28,6,41],[7,0,7,5],[7,6,7,22],[7,23,7,27],[7,28,7,41]]}
[null,null,null,null,null,null,null,null,null,"TÜRKİYE İŞ KURUMU GENEL MÜDÜRLÜĞÜ\nMALATYA ÇALIŞMA VE İŞ KURUMU İL MÜDÜLÜĞÜ"]
[]
[null,null,null,null,null,null,null,null,"EK-6: Toplum Yararına Proğram Katılımcı Devam Çizelgesi\n(3 Kişilik)"]
["          Bu çizelge İŞKUR'a gönderilmeyecektir. Yüklenici, her katılımcıya devam ettikleri her gün için bu çizelgeyi imzalatmak, muhafaza etmek ve ihtiyaç halinde yetkili kişi ve makamlara ibraz etmekle yükümlüdür."]
[]
["Ait Olduğu Yıl",null,null,null,null,null,{"$f":"IF(FORMÜL!D15=\"\",\"\",FORMÜL!D15)","v":2022},null,null,null,null,null,null,null,null,null,null,null,null,null,null,null,null,"Ait Olduğu Ay",null,null,null,null,{"$f":"IF(FORMÜL!G17=\"\",\"\",FORMÜL!G17)","v":"ŞUBAT"}]
["TYP No",null,null,null,null,null,{"$f":"IF(SABİT_BİLGİLER!K5=\"\",\"\",SABİT_BİLGİLER!K5)","v":"-"},null,null,null,null,null,null,null,null,null,null,null,null,null,null,null,null,"TYP Konusu",null,null,null,null,{"$f":"IF(SABİT_BİLGİLER!K8=\"\",\"\",SABİT_BİLGİLER!K8)","v":"TYP Kursiyerleri"}]
["TYP Başlama Tarihi",null,null,null,null,null,{"$f":"IF(SABİT_BİLGİLER!K6=\"\",\"\",SABİT_BİLGİLER!K6)","v":"2022-09-05"},null,null,null,null,null,null,null,null,null,null,null,null,null,null,null,null,"TYP Bitiş Tarihi",null,null,null,null,{"$f":"IF(SABİT_BİLGİLER!K7=\"\",\"\",SABİT_BİLGİLER!K7)","v":"… / 06 / 2023"}]
["Yüklenici Adı",null,null,null,null,null,{"$f":"IF(SABİT_BİLGİLER!AG14=0,\"SABİT BİLGİLER'den Okul Adı Gir!\",SABİT_BİLGİLER!AG14)","v":"SABİT BİLGİLER'den Okul Adı Gir!"},null,null,null,null,null,null,null,null,null,null,null,null,null,null,null,null,"Yüklenici Yetkilisi\nAd, Soyad\nUnvan ",null,null,null,null,{"$f":"IF(SABİT_BİLGİLER!AG16=0,\"SABİT BİLGİLER'den Yetkili İsmi Gir!\",SABİT_BİLGİLER!AG16)","v":"SABİT BİLGİLER'den Yetkili İsmi Gir!"},null,null,null,null,null,null,null,null,null,null,"İmza\nve\nMühür"]
[null,null,null,null,null,null,null,null,null,null,null,null,null,null,null,null,null,null,null,null,null,null,null,null,null,null,null,null,{"$f":"IF(SABİT_BİLGİLER!AG17=0,\"SABİT BİLGİLER'den Ünvan Gir!\",SABİT_BİLGİLER!AG17)","v":"SABİT BİLGİLER'den Ünvan Gir!"}]
[]
["Ad\nSoyad",null,null,null,{"$f":"IF(SABİT_BİLGİLER!K15=\"\",\"XXXXXXXXXXXXXXX\",SABİT_BİLGİLER!K15)","v":"XXXXXXXXXXXXXXX"},null,null,null,null,null,null,null,null,null,null,"Ad\nSoyad",null,null,null,{"$f":"IF(SABİT_BİLGİLER!K16=\"\",\"XXXXXXXXXXXXXXX\",SABİT_BİLGİLER!K16)","v":"XXXXXXXXXXXXXXX"},null,null,null,null,null,null,null,null,null,"Ad\nSoyad",null,null,null,{"$f":"IF(SABİT_BİLGİLER!K17=\"\",\"XXXXXXXXXXXXXXX\",SABİT_BİLGİLER!K17)","v":"XXXXXXXXXXXXXXX"}]
["T.C. \nKimlik No:",null,null,null,{"$f":"IF(SABİT_BİLGİLER!E15=\"\",\"XXXXXXXXXXXXXXX\",SABİT_BİLGİLER!E15)","v":"XXXXXXXXXXXXXXX"},null,null,null,null,null,null,null,null,null,null,"T.C. \nKimlik No:",null,null,null,{"$f":"IF(SABİT_BİLGİLER!E16=\"\",\"XXXXXXXXXXXXXXX\",SABİT_BİLGİLER!E16)","v":"XXXXXXXXXXXXXXX"},null,null,null,null,null,null,null,null,null,"T.C. \nKimlik No:",null,null,null,{"$f":"IF(SABİT_BİLGİLER!E17=\"\",\"XXXXXXXXXXXXXXX\",SABİT_BİLGİLER!E17)","v":"XXXXXXXXXXXXXXX"}]
["Gün",null,null,null,"Sabah",null,null,"Akşam",null,null,"Eğitim",null,null,null,null,"Gün",null,null,null,"Sabah",null,null,"Akşam",null,null,"Eğitim",null,null,null,"Gün",null,null,null,"Sabah",null,null,"Akşam",null,null,"Eğitim"]
[1,null,null,null,{"$f":"IF(FORMÜL!AJ4=\"\",\"\",FORMÜL!AJ4)","v":"XXXX"},null,null,{"$f":"IF(FORMÜL!AK4=\"\",\"\",FORMÜL!AK4)","v":"XXXX"},null,null,{"$f":"IF(FORMÜL!AL4=\"\",\"\",FORMÜL!AL4)","v":"XXXX"},null,null,null,null,1,null,null,null,{"$f":"IF(FORMÜL!AM4=\"\",\"\",FORMÜL!AM4)","v":"XXXX"},null,null,{"$f":"IF(FORMÜL!AN4=\"\",\"\",FORMÜL!AN4)","v":"XXXX"},null,null,{"$f":"IF(W15=\"XXXX\",\"XXXX\",IF(FORMÜL!AO4=\"\",\"\",FORMÜL!AO4))","v":"XXXX"},null,null,null,1,null,null,null,{"$f":"IF(FORMÜL!AP4=\"\",\"\",FORMÜL!AP4)","v":"XXXX"},null,null,{"$f":"IF(FORMÜL!AQ4=\"\",\"\",FORMÜL!AQ4)","v":"XXXX"},null,null,{"$f":"IF(AK15=\"XXXX\",\"XXXX\",IF(FORMÜL!AR4=\"\",\"\",FORMÜL!AR4))","v":"XXXX"}]
[2,null,null,null,{"$f":"IF(FORMÜL!AJ5=\"\",\"\",FORMÜL!AJ5)","v":"XXXX"},null,null,{"$f":"IF(FORMÜL!AK5=\"\",\"\",FORMÜL!AK5)","v":"XXXX"},null,null,{"$f":"IF(FORMÜL!AL5=\"\",\"\",FORMÜL!AL5)","v":"XXXX"},null,null,null,null,2,null,null,null,{"$f":"IF(FORMÜL!AM5=\"\",\"\",FORMÜL!AM5)","v":"XXXX"},null,null,{"$f":"IF(FORMÜL!AN5=\"\",\"\",FORMÜL!AN5)","v":"XXXX"},null,null,{"$f":"IF(W16=\"XXXX\",\"XXXX\",IF(FORMÜL!AO5=\"\",\"\",FORMÜL!AO5))","v":"XXXX"},null,null,null,2,null,null,null,{"$f":"IF(FORMÜL!AP5=\"\",\"\",FORMÜL!AP5)","v":"XXXX"},null,null,{"$f":"IF(FORMÜL!AQ5=\"\",\"\",FORMÜL!AQ5)","v":"XXXX"},null,null,{"$f":"IF(AK16=\"XXXX\",\"XXXX\",IF(FORMÜL!AR5=\"\",\"\",FORMÜL!AR5))","v":"XXXX"}]
[3,null,null,null,{"$f":"IF(FORMÜL!AJ6=\"\",\"\",FORMÜL!AJ6)","v":"XXXX"},null,null,{"$f":"IF(FORMÜL!AK6=\"\",\"\",FORMÜL!AK6)","v":"XXXX"},null,null,{"$f":"IF(FORMÜL!AL6=\"\",\"\",FORMÜL!AL6)","v":"XXXX"},null,null,null,null,3,null,null,null,{"$f":"IF(FORMÜL!AM6=\"\",\"\",FORMÜL!AM6)","v":"XXXX"},null,null,{"$f":"IF(FORMÜL!AN6=\"\",\"\",FORMÜL!AN6)","v":"XXXX"},null,null,{"$f":"IF(W17=\"XXXX\",\"XXXX\",IF(FORMÜL!AO6=\"\",\"\",FORMÜL!AO6))","v":"XXXX"},null,null,null,3,null,null,null,{"$f":"IF(FORMÜL!AP6=\"\",\"\",FORMÜL!AP6)","v":"XXXX"},null,null,{"$f":"IF(FORMÜL!AP6=\"\",\"\",FORMÜL!AP6)","v":"XXXX"},null,null,{"$f":"IF(AK17=\"XXXX\",\"XXXX\",IF(FORMÜL!AR6=\"\",\"\",FORMÜL!AR6))","v":"XXXX"}]
[4,null,null,null,{"$f":"IF(FORMÜL!AJ7=\"\",\"\",FORMÜL!AJ7)","v":"XXXX"},null,null,{"$f":"IF(FORMÜL!AK7=\"\",\"\",FORMÜL!AK7)","v":"XXXX"},null,null,{"$f":"IF(FORMÜL!AL7=\"\",\"\",FORMÜL!AL7)","v":"XXXX"},null,null,null,null,4,null,null,null,{"$f":"IF(FORMÜL!AM7=\"\",\"\",FORMÜL!AM7)","v":"XXXX"},null,null,{"$f":"IF(FORMÜL!AN7=\"\",\"\",FORMÜL!AN7)","v":"XXXX"},null,null,{"$f":"IF(W18=\"XXXX\",\"XXXX\",IF(FORMÜL!AO7=\"\",\"\",FORMÜL!AO7))","v":"XXXX"},null,null,null,4,null,null,null,{"$f":"IF(FORMÜL!AP7=\"\",\"\",FORMÜL!AP7)","v":"XXXX"},null,null,{"$f":"IF(FORMÜL!AQ7=\"\",\"\",FORMÜL!AQ7)","v":"XXXX"},null,null,{"$f":"IF(AK18=\"XXXX\",\"XXXX\",IF(FORMÜL!AR7=\"\",\"\",FORMÜL!AR7))","v":"XXXX"}]
[5,null,null,null,{"$f":"IF(FORMÜL!AJ8=\"\",\"\",FORMÜL!AJ8)","v":"XXXX"},null,null,{"$f":"IF(FORMÜL!AK8=\"\",\"\",FORMÜL!AK8)","v":"XXXX"},null,null,{"$f":"IF(FORMÜL!AL8=\"\",\"\",FORMÜL!AL8)","v":"XXXX"},null,null,null,null,5,null,null,null,{"$f":"IF(FORMÜL!AM8=\"\",\"\",FORMÜL!AM8)","v":"XXXX"},null,null,{"$f":"IF(FORMÜL!AN8=\"\",\"\",FORMÜL!AN8)","v":"XXXX"},null,null,{"$f":"IF(W19=\"XXXX\",\"XXXX\",IF(FORMÜL!AO8=\"\",\"\",FORMÜL!AO8))","v":"XXXX"},null,null,null,5,null,null,null,{"$f":"IF(FORMÜL!AP8=\"\",\"\",FORMÜL!AP8)","v":"XXXX"},null,null,{"$f":"IF(FORMÜL!AQ8=\"\",\"\",FORMÜL!AQ8)","v":"XXXX"},null,null,{"$f":"IF(AK19=\"XXXX\",\"XXXX\",IF(FORMÜL!AR8=\"\",\"\",FORMÜL!AR8))","v":"XXXX"}]
[6,null,null,null,{"$f":"IF(FORMÜL!AJ9=\"\",\"\",FORMÜL!AJ9)","v":"XXXX"},null,null,{"$f":"IF(FORMÜL!AK9=\"\",\"\",FORMÜL!AK9)","v":"XXXX"},null,null,{"$f":"IF(FORMÜL!AL9=\"\",\"\",FORMÜL!AL9)","v":"XXXX"},null,null,null,null,6,null,null,null,{"$f":"IF(FORMÜL!AM9=\"\",\"\",FORMÜL!AM9)","v":"XXXX"},null,null,{"$f":"IF(FORMÜL!AN9=\"\",\"\",FORMÜL!AN9)","v":"XXXX"},null,null,{"$f":"IF(W20=\"XXXX\",\"XXXX\",IF(FORMÜL!AO9=\"\",\"\",FORMÜL!AO9))","v":"XXXX"},null,null,null,6,null,null,null,{"$f":"IF(FORMÜL!AP9=\"\",\"\",FORMÜL!AP9)","v":"XXXX"},null,null,{"$f":"IF(FORMÜL!AQ9=\"\",\"\",FORMÜL!AQ9)","v":"XXXX"},null,null,{"$f":"IF(AK20=\"XXXX\",\"XXXX\",IF(FORMÜL!AR9=\"\",\"\",FORMÜL!AR9))","v":"XXXX"}]
[7,null,null,null,{"$f":"IF(FORMÜL!AJ10=\"\",\"\",FORMÜL!AJ10)","v":"XXXX"},null,null,{"$f":"IF(FORMÜL!AK10=\"\",\"\",FORMÜL!AK10)","v":"XXXX"},null,null,{"$f":"IF(FORMÜL!AL10=\"\",\"\",FORMÜL!AL10)","v":"XXXX"},null,null,null,null,7,null,null,null,{"$f":"IF(FORMÜL!AM10=\"\",\"\",FORMÜL!AM10)","v":"XXXX"},null,null,{"$f":"IF(FORMÜL!AN10=\"\",\"\",FORMÜL!AN10)","v":"XXXX"},null,null,{"$f":"IF(W21=\"XXXX\",\"XXXX\",IF(FORMÜL!AO10=\"\",\"\",FORMÜL!AO10))","v":"XXXX"},null,null,null,7,null,null,null,{"$f":"IF(FORMÜL!AP10=\"\",\"\",FORMÜL!AP10)","v":"XXXX"},null,null,{"$f":"IF(FORMÜL!AQ10=\"\",\"\",FORMÜL!AQ10)","v":"XXXX"},null,null,{"$f":"IF(AK21=\"XXXX\",\"XXXX\",IF(FORMÜL!AR10=\"\",\"\",FORMÜL!AR10))","v":"XXXX"}]
[8,null,null,null,{"$f":"IF(FORMÜL!AJ11=\"\",\"\",FORMÜL!AJ11)","v":"XXXX"},null,null,{"$f":"IF(FORMÜL!AK11=\"\",\"\",FORMÜL!AK11)","v":"XXXX"},null,null,{"$f":"IF(FORMÜL!AL11=\"\",\"\",FORMÜL!AL11)","v":"XXXX"},null,null,null,null,8,null,null,null,{"$f":"IF(FORMÜL!AM11=\"\",\"\",FORMÜL!AM11)","v":"XXXX"},null,null,{"$f":"IF(FORMÜL!AN11=\"\",\"\",FORMÜL!AN11)","v":"XXXX"},null,null,{"$f":"IF(W22=\"XXXX\",\"XXXX\",IF(FORMÜL!AO11=\"\",\"\",FORMÜL!AO11))","v":"XXXX"},null,null,null,8,null,null,null,{"$f":"IF(FORMÜL!AP11=\"\",\"\",FORMÜL!AP11)","v":"XXXX"},null,null,{"$f":"IF(FORMÜL!AQ11=\"\",\"\",FORMÜL!AQ11)","v":"XXXX"},null,null,{"$f":"IF(AK22=\"XXXX\",\"XXXX\",IF(FORMÜL!AR11=\"\",\"\",FORMÜL!AR11))","v":"XXXX"}]
[9,null,null,null,{"$f":"IF(FORMÜL!AJ12=\"\",\"\",FORMÜL!AJ12)","v":"XXXX"},null,null,{"$f":"IF(FORMÜL!AK12=\"\",\"\",FORMÜL!AK12)","v":"XXXX"},null,null,{"$f":"IF(FORMÜL!AL12=\"\",\"\",FORMÜL!AL12)","v":"XXXX"},null,null,null,null,9,null,null,null,{"$f":"IF(FORMÜL!AM12=\"\",\"\",FORMÜL!AM12)","v":"XXXX"},null,null,{"$f":"IF(FORMÜL!AN12=\"\",\"\",FORMÜL!AN12)","v":"XXXX"},null,null,{"$f":"IF(W23=\"XXXX\",\"XXXX\",IF(FORMÜL!AO12=\"\",\"\",FORMÜL!AO12))","v":"XXXX"},null,null,null,9,null,null,null,{"$f":"IF(FORMÜL!AP12=\"\",\"\",FORMÜL!AP12)","v":"XXXX"},null,null,{"$f":"IF(FORMÜL!AQ12=\"\",\"\",FORMÜL!AQ12)","v":"XXXX"},null,null,{"$f":"IF(AK23=\"XXXX\",\"XXXX\",IF(FORMÜL!AR12=\"\",\"\",FORMÜL!AR12))","v":"XXXX"}]
[10,null,null,null,{"$f":"IF(FORMÜL!AJ13=\"\",\"\",FORMÜL!AJ13)","v":"XXXX"},null,null,{"$f":"IF(FORMÜL!AK13=\"\",\"\",FORMÜL!AK13)","v":"XXXX"},null,null,{"$f":"IF(FORMÜL!AL13=\"\",\"\",FORMÜL!AL13)","v":"XXXX"},null,null,null,null,10,null,null,null,{"$f":"IF(FORMÜL!AM13=\"\",\"\",FORMÜL!AM13)","v":"XXXX"},null,null,{"$f":"IF(FORMÜL!AN13=\"\",\"\",FORMÜL!AN13)","v":"XXXX"},null,null,{"$f":"IF(W24=\"XXXX\",\"XXXX\",IF(FORMÜL!AO13=\"\",\"\",FORMÜL!AO13))","v":"XXXX"},null,null,null,10,null,null,null,{"$f":"IF(FORMÜL!AP13=\"\",\"\",FORMÜL!AP13)","v":"XXXX"},null,null,{"$f":"IF(FORMÜL!AQ13=\"\",\"\",FORMÜL!AQ13)","v":"XXXX"},null,null,{"$f":"IF(AK24=\"XXXX\",\"XXXX\",IF(FORMÜL!AR13=\"\",\"\",FORMÜL!AR13))","v":"XXXX"}]
[11,null,null,null,{"$f":"IF(FORMÜL!AJ14=\"\",\"\",FORMÜL!AJ14)","v":"XXXX"},null,null,{"$f":"IF(FORMÜL!AK14=\"\",\"\",FORMÜL!AK14)","v":"XXXX"},null,null,{"$f":"IF(FORMÜL!AL14=\"\",\"\",FORMÜL!AL14)","v":"XXXX"},null,null,null,null,11,null,null,null,{"$f":"IF(FORMÜL!AM14=\"\",\"\",FORMÜL!AM14)","v":"XXXX"},null,null,{"$f":"IF(FORMÜL!AN14=\"\",\"\",FORMÜL!AN14)","v":"XXXX"},null,null,{"$f":"IF(W25=\"XXXX\",\"XXXX\",IF(FORMÜL!AO14=\"\",\"\",FORMÜL!AO14))","v":"XXXX"},null,null,null,11,null,null,null,{"$f":"IF(FORMÜL!AP14=\"\",\"\",FORMÜL!AP14)","v":"XXXX"},null,null,{"$f":"IF(FORMÜL!AQ14=\"\",\"\",FORMÜL!AQ14)","v":"XXXX"},null,null,{"$f":"IF(AK25=\"XXXX\",\"XXXX\",IF(FORMÜL!AR14=\"\",\"\",FORMÜL!AR14))","v":"XXXX"}]
[12,null,null,null,{"$f":"IF(FORMÜL!AJ15=\"\",\"\",FORMÜL!AJ15)","v":"XXXX"},null,null,{"$f":"IF(FORMÜL!AK15=\"\",\"\",FORMÜL!AK15)","v":"XXXX"},null,null,{"$f":"IF(FORMÜL!AL15=\"\",\"\",FORMÜL!AL15)","v":"XXXX"},null,null,null,null,12,null,null,null,{"$f":"IF(FORMÜL!AM15=\"\",\"\",FORMÜL!AM15)","v":"XXXX"},null,null,{"$f":"IF(FORMÜL!AN15=\"\",\"\",FORMÜL!AN15)","v":"XXXX"},null,null,{"$f":"IF(W26=\"XXXX\",\"XXXX\",IF(FORMÜL!AO15=\"\",\"\",FORMÜL!AO15))","v":"XXXX"},null,null,null,12,null,null,null,{"$f":"IF(FORMÜL!AP15=\"\",\"\",FORMÜL!AP15)","v":"XXXX"},null,null,{"$f":"IF(FORMÜL!AQ15=\"\",\"\",FORMÜL!AQ15)","v":"XXXX"},null,null,{"$f":"IF(AK26=\"XXXX\",\"XXXX\",IF(FORMÜL!AR15=\"\",\"\",FORMÜL!AR15))","v":"XXXX"}]
[13,null,null,null,{"$f":"IF(FORMÜL!AJ16=\"\",\"\",FORMÜL!AJ16)","v":"XXXX"},null,null,{"$f":"IF(FORMÜL!AK16=\"\",\"\",FORMÜL!AK16)","v":"XXXX"},null,null,{"$f":"IF(FORMÜL!AL16=\"\",\"\",FORMÜL!AL16)","v":"XXXX"},null,null,null,null,13,null,null,null,{"$f":"IF(FORMÜL!AM16=\"\",\"\",FORMÜL!AM16)","v":"XXXX"},null,null,{"$f":"IF(FORMÜL!AN16=\"\",\"\",FORMÜL!AN16)","v":"XXXX"},null,null,{"$f":"IF(W27=\"XXXX\",\"XXXX\",IF(FORMÜL!AO16=\"\",\"\",FORMÜL!AO16))","v":"XXXX"},null,null,null,13,null,null,null,{"$f":"IF(FORMÜL!AP16=\"\",\"\",FORMÜL!AP16)","v":"XXXX"},null,null,{"$f":"IF(FORMÜL!AQ16=\"\",\"\",FORMÜL!AQ16)","v":"XXXX"},null,null,{"$f":"IF(AK27=\"XXXX\",\"XXXX\",IF(FORMÜL!AR16=\"\",\"\",FORMÜL!AR16))","v":"XXXX"}]
[14,null,null,null,{"$f":"IF(FORMÜL!AJ17=\"\",\"\",FORMÜL!AJ17)","v":"XXXX"},null,null,{"$f":"IF(FORMÜL!AK17=\"\",\"\",FORMÜL!AK17)","v":"XXXX"},null,null,{"$f":"IF(FORMÜL!AL17=\"\",\"\",FORMÜL!AL17)","v":"XXXX"},null,null,null,null,14,null,null,null,{"$f":"IF(FORMÜL!AM17=\"\",\"\",FORMÜL!AM17)","v":"XXXX"},null,null,{"$f":"IF(FORMÜL!AN17=\"\",\"\",FORMÜL!AN17)","v":"XXXX"},null,null,{"$f":"IF(W28=\"XXXX\",\"XXXX\",IF(FORMÜL!AO17=\"\",\"\",FORMÜL!AO17))","v":"XXXX"},null,null,null,14,null,null,null,{"$f":"IF(FORMÜL!AP17=\"\",\"\",FORMÜL!AP17)","v":"XXXX"},null,null,{"$f":"IF(FORMÜL!AQ17=\"\",\"\",FORMÜL!AQ17)","v":"XXXX"},null,null,{"$f":"IF(AK28=\"XXXX\",\"XXXX\",IF(FORMÜL!AR17=\"\",\"\",FORMÜL!AR17))","v":"XXXX"}]
[15,null,null,null,{"$f":"IF(FORMÜL!AJ18=\"\",\"\",FORMÜL!AJ18)","v":"XXXX"},null,null,{"$f":"IF(FORMÜL!AK18=\"\",\"\",FORMÜL!AK18)","v":"XXXX"},null,null,{"$f":"IF(FORMÜL!AL18=\"\",\"\",FORMÜL!AL18)","v":"XXXX"},null,null,null,null,15,null,null,null,{"$f":"IF(FORMÜL!AM18=\"\",\"\",FORMÜL!AM18)","v":"XXXX"},null,null,{"$f":"IF(FORMÜL!AN18=\"\",\"\",FORMÜL!AN18)","v":"XXXX"},null,null,{"$f":"IF(W29=\"XXXX\",\"XXXX\",IF(FORMÜL!AO18=\"\",\"\",FORMÜL!AO18))","v":"XXXX"},null,null,null,15,null,null,null,{"$f":"IF(FORMÜL!AP18=\"\",\"\",FORMÜL!AP18)","v":"XXXX"},null,null,{"$f":"IF(FORMÜL!AQ18=\"\",\"\",FORMÜL!AQ18)","v":"XXXX"},null,null,{"$f":"IF(AK29=\"XXXX\",\"XXXX\",IF(FORMÜL!AR18=\"\",\"\",FORMÜL!AR18))","v":"XXXX"}]
[16,null,null,null,{"$f":"IF(FORMÜL!AJ19=\"\",\"\",FORMÜL!AJ19)","v":"XXXX"},null,null,{"$f":"IF(FORMÜL!AK19=\"\",\"\",FORMÜL!AK19)","v":"XXXX"},null,null,{"$f":"IF(FORMÜL!AL19=\"\",\"\",FORMÜL!AL19)","v":"XXXX"},null,null,null,null,16,null,null,null,{"$f":"IF(FORMÜL!AM19=\"\",\"\",FORMÜL!AM19)","v":"XXXX"},null,null,{"$f":"IF(FORMÜL!AN19=\"\",\"\",FORMÜL!AN19)","v":"XXXX"},null,null,{"$f":"IF(W30=\"XXXX\",\"XXXX\",IF(FORMÜL!AO19=\"\",\"\",FORMÜL!AO19))","v":"XXXX"},null,null,null,16,null,null,null,{"$f":"IF(FORMÜL!AP19=\"\",\"\",FORMÜL!AP19)","v":"XXXX"},null,null,{"$f":"IF(FORMÜL!AQ19=\"\",\"\",FORMÜL!AQ19)","v":"XXXX"},null,null,{"$f":"IF(AK30=\"XXXX\",\"XXXX\",IF(FORMÜL!AR19=\"\",\"\",FORMÜL!AR19))","v":"XXXX"}]
[17,null,null,null,{"$f":"IF(FORMÜL!AJ20=\"\",\"\",FORMÜL!AJ20)","v":"XXXX"},null,null,{"$f":"IF(FORMÜL!AK20=\"\",\"\",FORMÜL!AK20)","v":"XXXX"},null,null,{"$f":"IF(FORMÜL!AL20=\"\",\"\",FORMÜL!AL20)","v":"XXXX"},null,null,null,null,17,null,null,null,{"$f":"IF(FORMÜL!AM20=\"\",\"\",FORMÜL!AM20)","v":"XXXX"},null,null,{"$f":"IF(FORMÜL!AN20=\"\",\"\",FORMÜL!AN20)","v":"XXXX"},null,null,{"$f":"IF(W31=\"XXXX\",\"XXXX\",IF(FORMÜL!AO20=\"\",\"\",FORMÜL!AO20))","v":"XXXX"},null,null,null,17,null,null,null,{"$f":"IF(FORMÜL!AP20=\"\",\"\",FORMÜL!AP20)","v":"XXXX"},null,null,{"$f":"IF(FORMÜL!AQ20=\"\",\"\",FORMÜL!AQ20)","v":"XXXX"},null,null,{"$f":"IF(AK31=\"XXXX\",\"XXXX\",IF(FORMÜL!AR20=\"\",\"\",FORMÜL!AR20))","v":"XXXX"}]
[18,null,null,null,{"$f":"IF(FORMÜL!AJ21=\"\",\"\",FORMÜL!AJ21)","v":"XXXX"},null,null,{"$f":"IF(FORMÜL!AK21=\"\",\"\",FORMÜL!AK21)","v":"XXXX"},null,null,{"$f":"IF(FORMÜL!AL21=\"\",\"\",FORMÜL!AL21)","v":"XXXX"},null,null,null,null,18,null,null,null,{"$f":"IF(FORMÜL!AM21=\"\",\"\",FORMÜL!AM21)","v":"XXXX"},null,null,{"$f":"IF(FORMÜL!AN21=\"\",\"\",FORMÜL!AN21)","v":"XXXX"},null,null,{"$f":"IF(W32=\"XXXX\",\"XXXX\",IF(FORMÜL!AO21=\"\",\"\",FORMÜL!AO21))","v":"XXXX"},null,null,null,18,null,null,null,{"$f":"IF(FORMÜL!AP21=\"\",\"\",FORMÜL!AP21)","v":"XXXX"},null,null,{"$f":"IF(FORMÜL!AQ21=\"\",\"\",FORMÜL!AQ21)","v":"XXXX"},null,null,{"$f":"IF(AK32=\"XXXX\",\"XXXX\",IF(FORMÜL!AR21=\"\",\"\",FORMÜL!AR21))","v":"XXXX"}]
[19,null,null,null,{"$f":"IF(FORMÜL!AJ22=\"\",\"\",FORMÜL!AJ22)","v":"XXXX"},null,null,{"$f":"IF(FORMÜL!AK22=\"\",\"\",FORMÜL!AK22)","v":"XXXX"},null,null,{"$f":"IF(FORMÜL!AL22=\"\",\"\",FORMÜL!AL22)","v":"XXXX"},null,null,null,null,19,null,null,null,{"$f":"IF(FORMÜL!AM22=\"\",\"\",FORMÜL!AM22)","v":"XXXX"},null,null,{"$f":"IF(FORMÜL!AN22=\"\",\"\",FORMÜL!AN22)","v":"XXXX"},null,null,{"$f":"IF(W33=\"XXXX\",\"XXXX\",IF(FORMÜL!AO22=\"\",\"\",FORMÜL!AO22))","v":"XXXX"},null,null,null,19,null,null,null,{"$f":"IF(FORMÜL!AP22=\"\",\"\",FORMÜL!AP22)","v":"XXXX"},null,null,{"$f":"IF(FORMÜL!AQ22=\"\",\"\",FORMÜL!AQ22)","v":"XXXX"},null,null,{"$f":"IF(AK33=\"XXXX\",\"XXXX\",IF(FORMÜL!AR22=\"\",\"\",FORMÜL!AR22))","v":"XXXX"}]
[20,null,null,null,{"$f":"IF(FORMÜL!AJ23=\"\",\"\",FORMÜL!AJ23)","v":"XXXX"},null,null,{"$f":"IF(FORMÜL!AK23=\"\",\"\",FORMÜL!AK23)","v":"XXXX"},null,null,{"$f":"IF(FORMÜL!AL23=\"\",\"\",FORMÜL!AL23)","v":"XXXX"},null,null,null,null,20,null,null,null,{"$f":"IF(FORMÜL!AM23=\"\",\"\",FORMÜL!AM23)","v":"XXXX"},null,null,{"$f":"IF(FORMÜL!AN23=\"\",\"\",FORMÜL!AN23)","v":"XXXX"},null,null,{"$f":"IF(W34=\"XXXX\",\"XXXX\",IF(FORMÜL!AO23=\"\",\"\",FORMÜL!AO23))","v":"XXXX"},null,null,null,20,null,null,null,{"$f":"IF(FORMÜL!AP23=\"\",\"\",FORMÜL!AP23)","v":"XXXX"},null,null,{"$f":"IF(FORMÜL!AQ23=\"\",\"\",FORMÜL!AQ23)","v":"XXXX"},null,null,{"$f":"IF(AK34=\"XXXX\",\"XXXX\",IF(FORMÜL!AR23=\"\",\"\",FORMÜL!AR23))","v":"XXXX"}]
[21,null,null,null,{"$f":"IF(FORMÜL!AJ24=\"\",\"\",FORMÜL!AJ24)","v":"XXXX"},null,null,{"$f":"IF(FORMÜL!AK24=\"\",\"\",FORMÜL!AK24)","v":"XXXX"},null,null,{"$f":"IF(FORMÜL!AL24=\"\",\"\",FORMÜL!AL24)","v":"XXXX"},null,null,null,null,21,null,null,null,{"$f":"IF(FORMÜL!AM24=\"\",\"\",FORMÜL!AM24)","v":"XXXX"},null,null,{"$f":"IF(FORMÜL!AN24=\"\",\"\",FORMÜL!AN24)","v":"XXXX"},null,null,{"$f":"IF(W35=\"XXXX\",\"XXXX\",IF(FORMÜL!AO24=\"\",\"\",FORMÜL!AO24))","v":"XXXX"},null,null,null,21,null,null,null,{"$f":"IF(FORMÜL!AP24=\"\",\"\",FORMÜL!AP24)","v":"XXXX"},null,null,{"$f":"IF(FORMÜL!AQ24=\"\",\"\",FORMÜL!AQ24)","v":"XXXX"},null,null,{"$f":"IF(AK35=\"XXXX\",\"XXXX\",IF(FORMÜL!AR24=\"\",\"\",FORMÜL!AR24))","v":"XXXX"}]
[22,null,null,null,{"$f":"IF(FORMÜL!AJ25=\"\",\"\",FORMÜL!AJ25)","v":"XXXX"},null,null,{"$f":"IF(FORMÜL!AK25=\"\",\"\",FORMÜL!AK25)","v":"XXXX"},null,null,{"$f":"IF(FORMÜL!AL25=\"\",\"\",FORMÜL!AL25)","v":"XXXX"},null,null,null,null,22,null,null,null,{"$f":"IF(FORMÜL!AM25=\"\",\"\",FORMÜL!AM25)","v":"XXXX"},null,null,{"$f":"IF(FORMÜL!AN25=\"\",\"\",FORMÜL!AN25)","v":"XXXX"},null,null,{"$f":"IF(W36=\"XXXX\",\"XXXX\",IF(FORMÜL!AO25=\"\",\"\",FORMÜL!AO25))","v":"XXXX"},null,null,null,22,null,null,null,{"$f":"IF(FORMÜL!AP25=\"\",\"\",FORMÜL!AP25)","v":"XXXX"},null,null,{"$f":"IF(FORMÜL!AQ25=\"\",\"\",FORMÜL!AQ25)","v":"XXXX"},null,null,{"$f":"IF(AK36=\"XXXX\",\"XXXX\",IF(FORMÜL!AR25=\"\",\"\",FORMÜL!AR25))","v":"XXXX"}]
[23,null,null,null,{"$f":"IF(FORMÜL!AJ26=\"\",\"\",FORMÜL!AJ26)","v":"XXXX"},null,null,{"$f":"IF(FORMÜL!AK26=\"\",\"\",FORMÜL!AK26)","v":"XXXX"},null,null,{"$f":"IF(FORMÜL!AL26=\"\",\"\",FORMÜL!AL26)","v":"XXXX"},null,null,null,null,23,null,null,null,{"$f":"IF(FORMÜL!AM26=\"\",\"\",FORMÜL!AM26)","v":"XXXX"},null,null,{"$f":"IF(FORMÜL!AN26=\"\",\"\",FORMÜL!AN26)","v":"XXXX"},null,null,{"$f":"IF(W37=\"XXXX\",\"XXXX\",IF(FORMÜL!AO26=\"\",\"\",FORMÜL!AO26))","v":"XXXX"},null,null,null,23,null,null,null,{"$f":"IF(FORMÜL!AP26=\"\",\"\",FORMÜL!AP26)","v":"XXXX"},null,null,{"$f":"IF(FORMÜL!AQ26=\"\",\"\",FORMÜL!AQ26)","v":"XXXX"},null,null,{"$f":"IF(AK37=\"XXXX\",\"XXXX\",IF(FORMÜL!AR26=\"\",\"\",FORMÜL!AR26))","v":"XXXX"}]
[24,null,null,null,{"$f":"IF(FORMÜL!AJ27=\"\",\"\",FORMÜL!AJ27)","v":"XXXX"},null,null,{"$f":"IF(FORMÜL!AK27=\"\",\"\",FORMÜL!AK27)","v":"XXXX"},null,null,{"$f":"IF(FORMÜL!AL27=\"\",\"\",FORMÜL!AL27)","v":"XXXX"},null,null,null,null,24,null,null,null,{"$f":"IF(FORMÜL!AM27=\"\",\"\",FORMÜL!AM27)","v":"XXXX"},null,null,{"$f":"IF(FORMÜL!AN27=\"\",\"\",FORMÜL!AN27)","v":"XXXX"},null,null,{"$f":"IF(W38=\"XXXX\",\"XXXX\",IF(FORMÜL!AO27=\"\",\"\",FORMÜL!AO27))","v":"XXXX"},null,null,null,24,null,null,null,{"$f":"IF(FORMÜL!AP27=\"\",\"\",FORMÜL!AP27)","v":"XXXX"},null,null,{"$f":"IF(FORMÜL!AQ27=\"\",\"\",FORMÜL!AQ27)","v":"XXXX"},null,null,{"$f":"IF(AK38=\"XXXX\",\"XXXX\",IF(FORMÜL!AR27=\"\",\"\",FORMÜL!AR27))","v":"XXXX"}]
[25,null,null,null,{"$f":"IF(FORMÜL!AJ28=\"\",\"\",FORMÜL!AJ28)","v":"XXXX"},null,null,{"$f":"IF(FORMÜL!AK28=\"\",\"\",FORMÜL!AK28)","v":"XXXX"},null,null,{"$f":"IF(FORMÜL!AL28=\"\",\"\",FORMÜL!AL28)","v":"XXXX"},null,null,null,null,25,null,null,null,{"$f":"IF(FORMÜL!AM28=\"\",\"\",FORMÜL!AM28)","v":"XXXX"},null,null,{"$f":"IF(FORMÜL!AN28=\"\",\"\",FORMÜL!AN28)","v":"XXXX"},null,null,{"$f":"IF(W39=\"XXXX\",\"XXXX\",IF(FORMÜL!AO28=\"\",\"\",FORMÜL!AO28))","v":"XXXX"},null,null,null,25,null,null,null,{"$f":"IF(FORMÜL!AP28=\"\",\"\",FORMÜL!AP28)","v":"XXXX"},null,null,{"$f":"IF(FORMÜL!AQ28=\"\",\"\",FORMÜL!AQ28)","v":"XXXX"},null,null,{"$f":"IF(AK39=\"XXXX\",\"XXXX\",IF(FORMÜL!AR28=\"\",\"\",FORMÜL!AR28))","v":"XXXX"}]
[26,null,null,null,{"$f":"IF(FORMÜL!AJ29=\"\",\"\",FORMÜL!AJ29)","v":"XXXX"},null,null,{"$f":"IF(FORMÜL!AK29=\"\",\"\",FORMÜL!AK29)","v":"XXXX"},null,null,{"$f":"IF(FORMÜL!AL29=\"\",\"\",FORMÜL!AL29)","v":"XXXX"},null,null,null,null,26,null,null,null,{"$f":"IF(FORMÜL!AM29=\"\",\"\",FORMÜL!AM29)","v":"XXXX"},null,null,{"$f":"IF(FORMÜL!AN29=\"\",\"\",FORMÜL!AN29)","v":"XXXX"},null,null,{"$f":"IF(W40=\"XXXX\",\"XXXX\",IF(FORMÜL!AO29=\"\",\"\",FORMÜL!AO29))","v":"XXXX"},null,null,null,26,null,null,null,{"$f":"IF(FORMÜL!AP29=\"\",\"\",FORMÜL!AP29)","v":"XXXX"},null,null,{"$f":"IF(FORMÜL!AQ29=\"\",\"\",FORMÜL!AQ29)","v":"XXXX"},null,null,{"$f":"IF(AK40=\"XXXX\",\"XXXX\",IF(FORMÜL!AR29=\"\",\"\",FORMÜL!AR29))","v":"XXXX"}]
[27,null,null,null,{"$f":"IF(FORMÜL!AJ30=\"\",\"\",FORMÜL!AJ30)","v":"XXXX"},null,null,{"$f":"IF(FORMÜL!AK30=\"\",\"\",FORMÜL!AK30)","v":"XXXX"},null,null,{"$f":"IF(FORMÜL!AL30=\"\",\"\",FORMÜL!AL30)","v":"XXXX"},null,null,null,null,27,null,null,null,{"$f":"IF(FORMÜL!AM30=\"\",\"\",FORMÜL!AM30)","v":"XXXX"},null,null,{"$f":"IF(FORMÜL!AN30=\"\",\"\",FORMÜL!AN30)","v":"XXXX"},null,null,{"$f":"IF(W41=\"XXXX\",\"XXXX\",IF(FORMÜL!AO30=\"\",\"\",FORMÜL!AO30))","v":"XXXX"},null,null,null,27,null,null,null,{"$f":"IF(FORMÜL!AP30=\"\",\"\",FORMÜL!AP30)","v":"XXXX"},null,null,{"$f":"IF(FORMÜL!AQ30=\"\",\"\",FORMÜL!AQ30)","v":"XXXX"},null,null,{"$f":"IF(AK41=\"XXXX\",\"XXXX\",IF(FORMÜL!AR30=\"\",\"\",FORMÜL!AR30))","v":"XXXX"}]
[28,null,null,null,{"$f":"IF(FORMÜL!AJ31=\"\",\"\",FORMÜL!AJ31)","v":"XXXX"},null,null,{"$f":"IF(FORMÜL!AK31=\"\",\"\",FORMÜL!AK31)","v":"XXXX"},null,null,{"$f":"IF(FORMÜL!AL31=\"\",\"\",FORMÜL!AL31)","v":"XXXX"},null,null,null,null,28,null,null,null,{"$f":"IF(FORMÜL!AM31=\"\",\"\",FORMÜL!AM31)","v":"XXXX"},null,null,{"$f":"IF(FORMÜL!AN31=\"\",\"\",FORMÜL!AN31)","v":"XXXX"},null,null,{"$f":"IF(W42=\"XXXX\",\"XXXX\",IF(FORMÜL!AO31=\"\",\"\",FORMÜL!AO31))","v":"XXXX"},null,null,null,28,null,null,null,{"$f":"IF(FORMÜL!AP31=\"\",\"\",FORMÜL!AP31)","v":"XXXX"},null,null,{"$f":"IF(FORMÜL!AQ31=\"\",\"\",FORMÜL!AQ31)","v":"XXXX"},null,null,{"$f":"IF(AK42=\"XXXX\",\"XXXX\",IF(FORMÜL!AR31=\"\",\"\",FORMÜL!AR31))","v":"XXXX"}]
[{"$f":"IF(FORMÜL!L32=\"\",\"XXXX\",\"29\")","v":"XXXX"},null,null,null,{"$f":"IF(FORMÜL!AJ32=\"\",\"\",FORMÜL!AJ32)","v":"XXXX"},null,null,{"$f":"IF(FORMÜL!AK32=\"\",\"\",FORMÜL!AK32)","v":"XXXX"},null,null,{"$f":"IF(FORMÜL!AL32=\"\",\"\",FORMÜL!AL32)","v":"XXXX"},null,null,null,null,{"$f":"IF(FORMÜL!L32=\"\",\"XXXX\",\"29\")","v":"XXXX"},null,null,null,{"$f":"IF(FORMÜL!AM32=\"\",\"\",FORMÜL!AM32)","v":"XXXX"},null,null,{"$f":"IF(FORMÜL!AN32=\"\",\"\",FORMÜL!AN32)","v":"XXXX"},null,null,{"$f":"IF(W43=\"XXXX\",\"XXXX\",IF(FORMÜL!AO32=\"\",\"\",FORMÜL!AO32))","v":"XXXX"},null,null,null,{"$f":"IF(FORMÜL!L32=\"\",\"XXXX\",\"29\")","v":"XXXX"},null,null,null,{"$f":"IF(FORMÜL!AP32=\"\",\"\",FORMÜL!AP32)","v":"XXXX"},null,null,{"$f":"IF(FORMÜL!AQ32=\"\",\"\",FORMÜL!AQ32)","v":"XXXX"},null,null,{"$f":"IF(AK43=\"XXXX\",\"XXXX\",IF(FORMÜL!AR32=\"\",\"\",FORMÜL!AR32))","v":"XXXX"}]
[{"$f":"IF(FORMÜL!L33=\"\",\"XXXX\",\"30\")","v":"XXXX"},null,null,null,{"$f":"IF(FORMÜL!AJ33=\"\",\"\",FORMÜL!AJ33)","v":"XXXX"},null,null,{"$f":"IF(FORMÜL!AK33=\"\",\"\",FORMÜL!AK33)","v":"XXXX"},null,null,{"$f":"IF(FORMÜL!AL33=\"\",\"\",FORMÜL!AL33)","v":"XXXX"},null,null,null,null,{"$f":"IF(FORMÜL!L33=\"\",\"XXXX\",\"30\")","v":"XXXX"},null,null,null,{"$f":"IF(FORMÜL!AM33=\"\",\"\",FORMÜL!AM33)","v":"XXXX"},null,null,{"$f":"IF(FORMÜL!AN33=\"\",\"\",FORMÜL!AN33)","v":"XXXX"},null,null,{"$f":"IF(W44=\"XXXX\",\"XXXX\",IF(FORMÜL!AO33=\"\",\"\",FORMÜL!AO33))","v":"XXXX"},null,null,null,{"$f":"IF(FORMÜL!L33=\"\",\"XXXX\",\"30\")","v":"XXXX"},null,null,null,{"$f":"IF(FORMÜL!AP33=\"\",\"\",FORMÜL!AP33)","v":"XXXX"},null,null,{"$f":"IF(FORMÜL!AQ33=\"\",\"\",FORMÜL!AQ33)","v":"XXXX"},null,null,{"$f":"IF(AK44=\"XXXX\",\"XXXX\",IF(FORMÜL!AR33=\"\",\"\",FORMÜL!AR33))","v":"XXXX"}]
[{"$f":"IF(FORMÜL!L34=\"\",\"XXXX\",\"31\")","v":"XXXX"},null,null,null,{"$f":"IF(FORMÜL!AJ34=\"\",\"\",FORMÜL!AJ34)","v":"XXXX"},null,null,{"$f":"IF(FORMÜL!AK34=\"\",\"\",FORMÜL!AK34)","v":"XXXX"},null,null,{"$f":"IF(FORMÜL!AL34=\"\",\"\",FORMÜL!AL34)","v":"XXXX"},null,null,null,null,{"$f":"IF(FORMÜL!L34=\"\",\"XXXX\",\"31\")","v":"XXXX"},null,null,null,{"$f":"IF(FORMÜL!AM34=\"\",\"\",FORMÜL!AM34)","v":"XXXX"},null,null,{"$f":"IF(FORMÜL!AN34=\"\",\"\",FORMÜL!AN34)","v":"XXXX"},null,null,{"$f":"IF(W45=\"XXXX\",\"XXXX\",IF(FORMÜL!AO34=\"\",\"\",FORMÜL!AO34))","v":"XXXX"},null,null,null,{"$f":"IF(FORMÜL!L34=\"\",\"XXXX\",\"31\")","v":"XXXX"},null,null,null,{"$f":"IF(FORMÜL!AP34=\"\",\"\",FORMÜL!AP34)","v":"XXXX"},null,null,{"$f":"IF(FORMÜL!AQ34=\"\",\"\",FORMÜL!AQ34)","v":"XXXX"},null,null,{"$f":"IF(AK45=\"XXXX\",\"XXXX\",IF(FORMÜL!AR34=\"\",\"\",FORMÜL!AR34))","v":"XXXX"}]
[]
["NOT: Her Ayın 1'inde TYÇP Devam Takip Çizelgelerinin Müdürlüğümüzde Olacak Şekilde Gönderilmesi Önemle Rica Olunur."]

{"sheet":"FORMÜL","index":5,"n_rows":34,"n_cols":44,"rows_kept":34,"cut":false,"hidden":false,"merged":[[0,35,0,37],[0,38,0,40],[0,41,0,43],[6,14,6,21],[1,14,1,21],[2,2,2,3],[2,5,2,6],[1,35,1,37],[1,38,1,40],[1,41,1,43]]}
[null,null,null,null,null,null,null,null,null,null,null,null,null,null,null,null,null,null,null,null,null,null,null,null,null,null,null,null,null,null,{"$f":"IF(SABİT_BİLGİLER!E15=\"\",1,0)","v":1},{"$f":"IF(SABİT_BİLGİLER!E16=\"\",1,0)","v":1},{"$f":"IF(SABİT_BİLGİLER!E17=\"\",1,0)","v":1},null,null,{"$f":"IF(SABİT_BİLGİLER!K15=\"\",1,0)","v":1},null,null,{"$f":"IF(SABİT_BİLGİLER!K16=\"\",1,0)","v":1},null,null,{"$f":"IF(SABİT_BİLGİLER!K17=\"\",1,0)","v":1}]
[null,null,null,null,null,null,null,null,null,null,null,null,null,null,"ÇALIŞMA GÜNÜ",null,null,null,null,null,null,null,null,null,null,null,null,null,null,null,null,null,null,null,null,"1. ADAM",null,null,"2. ADAM",null,null,"3. ADAM"]
[null,null,"YIL SEÇİMİ",null,null,"AY SEÇİMİ",null,null,"GÜN NO","TARİH","AY BUL","TARİH SIRALA","GÜN BUL",null,null,1,2,3,4,5,6,7,null,"EĞİTİM",null,"TÜMTATİL",null,"SABAH","AKŞAM",null,"1. ADAM","2. ADAM","3. ADAM",null,null,"SABAH","AKŞAM","EĞİTİM","SABAH","AKŞAM","EĞİTİM","SABAH","AKŞAM","EĞİTİM"]
[null,null,1,2021,null,1,"OCAK",null,1,{"$f":"C17+1-1","v":"2022-02-01"},{"$f":"MONTH(J4)","v":2},{"$f":"IF(K4=$F$17,J4,\"\")","v":"2022-02-01"},{"$f":"IF(K4=$F$17,WEEKDAY(L4,2),\"\")","v":2},null,"SABAH",{"$f":"IF(TARİH_GÜN_SEÇİMİ!AR10=0,0,1)","v":0},{"$f":"IF(TARİH_GÜN_SEÇİMİ!AR11=0,0,1)","v":0},{"$f":"IF(TARİH_GÜN_SEÇİMİ!AR12=0,0,1)","v":0},{"$f":"IF(TARİH_GÜN_SEÇİMİ!AR13=0,0,1)","v":0},{"$f":"IF(TARİH_GÜN_SEÇİMİ!AR14=0,0,1)","v":0},{"$f":"IF(TARİH_GÜN_SEÇİMİ!AR15=0,0,1)","v":1},{"$f":"IF(TARİH_GÜN_SEÇİMİ!AR16=0,0,1)","v":1},null,{"$f":"IF(L4=\"\",1,HLOOKUP(M4,$P$8:$V$9,2))","v":1},null,{"$f":"IF(L4=\"\",1,TARİH_GÜN_SEÇİMİ!Y29)","v":0},null,{"$f":"IF(L4=\"\",1,HLOOKUP(M4,$P$3:$V$5,2))","v":0},{"$f":"IF(L4=\"\",1,HLOOKUP(M4,$P$3:$V$5,3))","v":0},null,{"$f":"'ELLE_TATİL_GİR!'!P4","v":0},{"$f":"'ELLE_TATİL_GİR!'!Q4","v":0},{"$f":"'ELLE_TATİL_GİR!'!R4","v":0},null,1,{"$f":"IF(ADAM1=1,TATİL_SABİTİ,IF(AE4=1,TATİL_SABİTİ,IF($AJ$1=1,TATİL_SABİTİ,IF((Z4+AB4+AE4)=0,\"\",TATİL_SABİTİ))))","v":"XXXX"},{"$f":"IF(ADAM1=1,TATİL_SABİTİ,IF(AE4=1,TATİL_SABİTİ,IF($AJ$1=1,TATİL_SABİTİ,IF((Z4+AB4+AE4)=0,\"\",TATİL_SABİTİ))))","v":"XXXX"},{"$f":"IF(ADAM1=1,TATİL_SABİTİ,IF(AE4=1,TATİL_SABİTİ,IF($AJ$1=1,TATİL_SABİTİ,IF(Z4=1,TATİL_SABİTİ,IF($AJ$1=1,TATİL_SABİTİ,IF(X4=1,TATİL_SABİTİ,\"\"))))))","v":"XXXX"},{"$f":"IF(AF4=1,TATİL_SABİTİ,IF($AM$1=1,TATİL_SABİTİ,IF((Z4+AB4+AF4)=0,\"\",TATİL_SABİTİ)))","v":"XXXX"},{"$f":"IF(AF4=1,TATİL_SABİTİ,IF($AM$1=1,TATİL_SABİTİ,IF((Z4+AB4+AF4)=0,\"\",TATİL_SABİTİ)))","v":"XXXX"},{"$f":"IF(AF4=1,TATİL_SABİTİ,IF($AM$1=1,TATİL_SABİTİ,IF(Z4=1,TATİL_SABİTİ,IF($AJ$1=1,TATİL_SABİTİ,IF(X4=1,TATİL_SABİTİ,\"\")))))","v":"XXXX"},{"$f":"IF(AG4=1,TATİL_SABİTİ,IF($AP$1=1,TATİL_SABİTİ,IF((Z4+AB4+AG4)=0,\"\",TATİL_SABİTİ)))","v":"XXXX"},{"$f":"IF(AG4=1,TATİL_SABİTİ,IF($AP$1=1,TATİL_SABİTİ,IF((Z4+AB4+AG4)=0,\"\",TATİL_SABİTİ)))","v":"XXXX"},{"$f":"IF(AG4=1,TATİL_SABİTİ,IF($AP$1=1,TATİL_SABİTİ,IF(Z4=1,TATİL_SABİTİ,IF($AJ$1=1,TATİL_SABİTİ,IF(X4=1,TATİL_SABİTİ,\"\")))))","v":"XXXX"}]
[null,null,2,2022,null,2,"ŞUBAT",null,2,{"$f":"J4+1","v":"2022-02-02"},{"$f":"MONTH(J5)","v":2},{"$f":"IF(K5=$F$17,J5,\"\")","v":"2022-02-02"},{"$f":"IF(K5=$F$17,WEEKDAY(L5,2),\"\")","v":3},null,"AKŞAM",{"$f":"IF(TARİH_GÜN_SEÇİMİ!AS10=0,0,1)","v":0},{"$f":"IF(TARİH_GÜN_SEÇİMİ!AS11=0,0,1)","v":0},{"$f":"IF(TARİH_GÜN_SEÇİMİ!AS12=0,0,1)","v":0},{"$f":"IF(TARİH_GÜN_SEÇİMİ!AS13=0,0,1)","v":0},{"$f":"IF(TARİH_GÜN_SEÇİMİ!AS14=0,0,1)","v":0},{"$f":"IF(TARİH_GÜN_SEÇİMİ!AS15=0,0,1)","v":1},{"$f":"IF(TARİH_GÜN_SEÇİMİ!AS16=0,0,1)","v":1},null,{"$f":"IF(L5=\"\",1,HLOOKUP(M5,$P$8:$V$9,2))","v":0},null,{"$f":"IF(L5=\"\",1,TARİH_GÜN_SEÇİMİ!Y30)","v":0},null,{"$f":"IF(L5=\"\",1,HLOOKUP(M5,$P$3:$V$5,2))","v":0},{"$f":"IF(L5=\"\",1,HLOOKUP(M5,$P$3:$V$5,3))","v":0},null,{"$f":"'ELLE_TATİL_GİR!'!P5","v":0},{"$f":"'ELLE_TATİL_GİR!'!Q5","v":0},{"$f":"'ELLE_TATİL_GİR!'!R5","v":0},null,2,"XXXX","XXXX","XXXX","XXXX","XXXX","XXXX","XXXX","XXXX","XXXX"]
[null,null,3,2023,null,3,"MART",null,3,{"$f":"J5+1","v":"2022-02-03"},2,"2022-02-03",4,null,null,null,null,null,null,null,null,null,null,1,null,{"$f":"IF(L6=\"\",1,TARİH_GÜN_SEÇİMİ!Y31)","v":0},null,0,0,null,{"$f":"'ELLE_TATİL_GİR!'!P6","v":0},{"$f":"'ELLE_TATİL_GİR!'!Q6","v":0},{"$f":"'ELLE_TATİL_GİR!'!R6","v":0},null,3,"XXXX","XXXX","XXXX","XXXX","XXXX","XXXX","XXXX","XXXX","XXXX"]
[null,null,4,2024,null,4,"NISAN",null,4,"2022-02-04",2,"2022-02-04",5,null,"EĞİTİM GÜNÜ",null,null,null,null,null,null,null,null,1,null,{"$f":"IF(L7=\"\",1,TARİH_GÜN_SEÇİMİ!Y32)","v":0},null,0,0,null,{"$f":"'ELLE_TATİL_GİR!'!P7","v":0},{"$f":"'ELLE_TATİL_GİR!'!Q7","v":0},{"$f":"'ELLE_TATİL_GİR!'!R7","v":0},null,4,"XXXX","XXXX","XXXX","XXXX","XXXX","XXXX","XXXX","XXXX","XXXX"]
[null,null,5,2025,null,5,"MAYIS",null,5,"2022-02-05",2,"2022-02-05",6,null,null,1,2,3,4,5,6,7,null,1,null,{"$f":"IF(L8=\"\",1,TARİH_GÜN_SEÇİMİ!Y33)","v":0},null,1,1,null,{"$f":"'ELLE_TATİL_GİR!'!P8","v":0},{"$f":"'ELLE_TATİL_GİR!'!Q8","v":0},{"$f":"'ELLE_TATİL_GİR!'!R8","v":0},null,5,"XXXX","XXXX","XXXX","XXXX","XXXX","XXXX","XXXX","XXXX","XXXX"]
[null,null,6,2026,null,6,"HAZIRAN",null,6,"2022-02-06",2,"2022-02-06",7,null,"SABAH",{"$f":"IF(TARİH_GÜN_SEÇİMİ!BL10=0,0,1)","v":1},{"$f":"IF(TARİH_GÜN_SEÇİMİ!BL11=0,0,1)","v":1},{"$f":"IF(TARİH_GÜN_SEÇİMİ!BL12=0,0,1)","v":0},{"$f":"IF(TARİH_GÜN_SEÇİMİ!BL13=0,0,1)","v":1},{"$f":"IF(TARİH_GÜN_SEÇİMİ!BL14=0,0,1)","v":1},{"$f":"IF(TARİH_GÜN_SEÇİMİ!BL15=0,0,1)","v":1},{"$f":"IF(TARİH_GÜN_SEÇİMİ!BL16=0,0,1)","v":1},null,1,null,{"$f":"IF(L9=\"\",1,TARİH_GÜN_SEÇİMİ!Y34)","v":0},null,1,1,null,{"$f":"'ELLE_TATİL_GİR!'!P9","v":0},{"$f":"'ELLE_TATİL_GİR!'!Q9","v":0},{"$f":"'ELLE_TATİL_GİR!'!R9","v":0},null,6,"XXXX","XXXX","XXXX","XXXX","XXXX","XXXX","XXXX","XXXX","XXXX"]
[null,null,7,2027,null,7,"TEMMUZ",null,7,"2022-02-07",2,"2022-02-07",1,null,null,null,null,null,null,null,null,null,null,1,null,{"$f":"IF(L10=\"\",1,TARİH_GÜN_SEÇİMİ!Y35)","v":0},null,0,0,null,{"$f":"'ELLE_TATİL_GİR!'!P10","v":0},{"$f":"'ELLE_TATİL_GİR!'!Q10","v":0},{"$f":"'ELLE_TATİL_GİR!'!R10","v":0},null,7,"XXXX","XXXX","XXXX","XXXX","XXXX","XXXX","XXXX","XXXX","XXXX"]
[null,null,8,2028,null,8,"AĞUSTOS",null,8,"2022-02-08",2,"2022-02-08",2,null,null,null,null,null,null,null,null,null,null,1,null,{"$f":"IF(L11=\"\",1,TARİH_GÜN_SEÇİMİ!Y36)","v":0},null,0,0,null,{"$f":"'ELLE_TATİL_GİR!'!P11","v":0},{"$f":"'ELLE_TATİL_GİR!'!Q11","v":0},{"$f":"'ELLE_TATİL_GİR!'!R11","v":0},null,8,"XXXX","XXXX","XXXX","XXXX","XXXX","XXXX","XXXX","XXXX","XXXX"]
[null,null,9,2029,null,9,"EYLÜL",null,9,"2022-02-09",2,"2022-02-09",3,null,null,null,null,null,null,null,null,null,null,0,null,{"$f":"IF(L12=\"\",1,TARİH_GÜN_SEÇİMİ!Y37)","v":0},null,0,0,null,{"$f":"'ELLE_TATİL_GİR!'!P12","v":0},{"$f":"'ELLE_TATİL_GİR!'!Q12","v":0},{"$f":"'ELLE_TATİL_GİR!'!R12","v":0},null,9,"XXXX","XXXX","XXXX","XXXX","XXXX","XXXX","XXXX","XXXX","XXXX"]
[null,null,10,2030,null,10,"EKIM",null,10,"2022-02-10",2,"2022-02-10",4,null,null,null,null,null,null,null,null,null,null,1,null,{"$f":"IF(L13=\"\",1,TARİH_GÜN_SEÇİMİ!Y38)","v":0},null,0,0,null,{"$f":"'ELLE_TATİL_GİR!'!P13","v":0},{"$f":"'ELLE_TATİL_GİR!'!Q13","v":0},{"$f":"'ELLE_TATİL_GİR!'!R13","v":0},null,10,"XXXX","XXXX","XXXX","XXXX","XXXX","XXXX","XXXX","XXXX","XXXX"]
[null,null,null,null,null,11,"KASIM",null,11,"2022-02-11",2,"2022-02-11",5,null,null,null,null,null,null,null,null,null,null,1,null,{"$f":"IF(L14=\"\",1,TARİH_GÜN_SEÇİMİ!Y39)","v":0},null,0,0,null,{"$f":"'ELLE_TATİL_GİR!'!P14","v":0},{"$f":"'ELLE_TATİL_GİR!'!Q14","v":0},{"$f":"'ELLE_TATİL_GİR!'!R14","v":0},null,11,"XXXX","XXXX","XXXX","XXXX","XXXX","XXXX","XXXX","XXXX","XXXX"]
[null,null,2,{"$f":"VLOOKUP(C15,C4:D13,2)","v":2022},null,12,"ARALIK",null,12,"2022-02-12",2,"2022-02-12",6,null,null,null,null,null,null,null,null,null,null,1,null,{"$f":"IF(L15=\"\",1,TARİH_GÜN_SEÇİMİ!Y40)","v":0},null,1,1,null,{"$f":"'ELLE_TATİL_GİR!'!P15","v":0},{"$f":"'ELLE_TATİL_GİR!'!Q15","v":0},{"$f":"'ELLE_TATİL_GİR!'!R15","v":0},null,12,"XXXX","XXXX","XXXX","XXXX","XXXX","XXXX","XXXX","XXXX","XXXX"]
[null,null,null,null,null,null,null,null,13,"2022-02-13",2,"2022-02-13",7,null,null,null,null,null,null,null,null,null,null,1,null,{"$f":"IF(L16=\"\",1,TARİH_GÜN_SEÇİMİ!Y41)","v":0},null,1,1,null,{"$f":"'ELLE_TATİL_GİR!'!P16","v":0},{"$f":"'ELLE_TATİL_GİR!'!Q16","v":0},{"$f":"'ELLE_TATİL_GİR!'!R16","v":0},null,13,"XXXX","XXXX","XXXX","XXXX","XXXX","XXXX","XXXX","XXXX","XXXX"]
[null,null,{"$f":"\"01.\"&F17&\".\"&D15","v":"01.2.2022"},null,null,2,{"$f":"VLOOKUP(F17,F4:G15,2)","v":"ŞUBAT"},null,14,"2022-02-14",2,"2022-02-14",1,null,null,null,null,null,null,null,null,null,null,1,null,{"$f":"IF(L17=\"\",1,TARİH_GÜN_SEÇİMİ!Y42)","v":0},null,0,0,null,{"$f":"'ELLE_TATİL_GİR!'!P17","v":0},{"$f":"'ELLE_TATİL_GİR!'!Q17","v":0},{"$f":"'ELLE_TATİL_GİR!'!R17","v":0},null,14,"XXXX","XXXX","XXXX","XXXX","XXXX","XXXX","XXXX","XXXX","XXXX"]
[null,null,null,null,null,null,null,null,15,"2022-02-15",2,"2022-02-15",2,null,null,null,null,null,null,null,null,null,null,1,null,{"$f":"IF(L18=\"\",1,TARİH_GÜN_SEÇİMİ!Y43)","v":0},null,0,0,null,{"$f":"'ELLE_TATİL_GİR!'!P18","v":0},{"$f":"'ELLE_TATİL_GİR!'!Q18","v":0},{"$f":"'ELLE_TATİL_GİR!'!R18","v":0},null,15,"XXXX","XXXX","XXXX","XXXX","XXXX","XXXX","XXXX","XXXX","XXXX"]
[null,null,null,null,null,null,null,null,16,"2022-02-16",2,"2022-02-16",3,null,null,null,null,null,null,null,null,null,null,0,null,{"$f":"IF(L19=\"\",1,TARİH_GÜN_SEÇİMİ!Y44)","v":0},null,0,0,null,{"$f":"'ELLE_TATİL_GİR!'!P19","v":0},{"$f":"'ELLE_TATİL_GİR!'!Q19","v":0},{"$f":"'ELLE_TATİL_GİR!'!R19","v":0},null,16,"XXXX","XXXX","XXXX","XXXX","XXXX","XXXX","XXXX","XXXX","XXXX"]
[null,null,null,null,null,null,null,null,17,"2022-02-17",2,"2022-02-17",4,null,null,null,null,null,null,null,null,null,null,1,null,{"$f":"IF(L20=\"\",1,TARİH_GÜN_SEÇİMİ!Y45)","v":0},null,0,0,null,{"$f":"'ELLE_TATİL_GİR!'!P20","v":0},{"$f":"'ELLE_TATİL_GİR!'!Q20","v":0},{"$f":"'ELLE_TATİL_GİR!'!R20","v":0},null,17,"XXXX","XXXX","XXXX","XXXX","XXXX","XXXX","XXXX","XXXX","XXXX"]
[null,null,null,null,null,null,null,null,18,"2022-02-18",2,"2022-02-18",5,null,null,null,null,null,null,null,null,null,null,1,null,{"$f":"IF(L21=\"\",1,TARİH_GÜN_SEÇİMİ!Y46)","v":0},null,0,0,null,{"$f":"'ELLE_TATİL_GİR!'!P21","v":0},{"$f":"'ELLE_TATİL_GİR!'!Q21","v":0},{"$f":"'ELLE_TATİL_GİR!'!R21","v":0},null,18,"XXXX","XXXX","XXXX","XXXX","XXXX","XXXX","XXXX","XXXX","XXXX"]
[null,null,null,null,null,null,null,null,19,"2022-02-19",2,"2022-02-19",6,null,null,null,null,null,null,null,null,null,null,1,null,{"$f":"IF(L22=\"\",1,TARİH_GÜN_SEÇİMİ!Y47)","v":0},null,1,1,null,{"$f":"'ELLE_TATİL_GİR!'!P22","v":0},{"$f":"'ELLE_TATİL_GİR!'!Q22","v":0},{"$f":"'ELLE_TATİL_GİR!'!R22","v":0},null,19,"XXXX","XXXX","XXXX","XXXX","XXXX","XXXX","XXXX","XXXX","XXXX"]
[null,null,null,null,null,null,null,null,20,"2022-02-20",2,"2022-02-20",7,null,null,null,null,null,null,null,null,null,null,1,null,{"$f":"IF(L23=\"\",1,TARİH_GÜN_SEÇİMİ!Y48)","v":0},null,1,1,null,{"$f":"'ELLE_TATİL_GİR!'!P23","v":0},{"$f":"'ELLE_TATİL_GİR!'!Q23","v":0},{"$f":"'ELLE_TATİL_GİR!'!R23","v":0},null,20,"XXXX","XXXX","XXXX","XXXX","XXXX","XXXX","XXXX","XXXX","XXXX"]
[null,null,null,null,null,null,null,null,21,"2022-02-21",2,"2022-02-21",1,null,null,null,null,null,null,null,null,null,null,1,null,{"$f":"IF(L24=\"\",1,TARİH_GÜN_SEÇİMİ!Y49)","v":0},null,0,0,null,{"$f":"'ELLE_TATİL_GİR!'!P24","v":0},{"$f":"'ELLE_TATİL_GİR!'!Q24","v":0},{"$f":"'ELLE_TATİL_GİR!'!R24","v":0},null,21,"XXXX","XXXX","XXXX","XXXX","XXXX","XXXX","XXXX","XXXX","XXXX"]
[null,null,null,null,null,null,null,null,22,"2022-02-22",2,"2022-02-22",2,null,null,null,null,null,null,null,null,null,null,1,null,{"$f":"IF(L25=\"\",1,TARİH_GÜN_SEÇİMİ!Y50)","v":0},null,0,0,null,{"$f":"'ELLE_TATİL_GİR!'!P25","v":0},{"$f":"'ELLE_TATİL_GİR!'!Q25","v":0},{"$f":"'ELLE_TATİL_GİR!'!R25","v":0},null,22,"XXXX","XXXX","XXXX","XXXX","XXXX","XXXX","XXXX","XXXX","XXXX"]
[null,null,null,null,null,null,null,null,23,"2022-02-23",2,"2022-02-23",3,null,null,null,null,null,null,null,null,null,null,0,null,{"$f":"IF(L26=\"\",1,TARİH_GÜN_SEÇİMİ!Y51)","v":0},null,0,0,null,{"$f":"'ELLE_TATİL_GİR!'!P26","v":0},{"$f":"'ELLE_TATİL_GİR!'!Q26","v":0},{"$f":"'ELLE_TATİL_GİR!'!R26","v":0},null,23,"XXXX","XXXX","XXXX","XXXX","XXXX","XXXX","XXXX","XXXX","XXXX"]
[null,null,null,null,null,null,null,null,24,"2022-02-24",2,"2022-02-24",4,null,null,null,null,null,null,null,null,null,null,1,null,{"$f":"IF(L27=\"\",1,TARİH_GÜN_SEÇİMİ!Y52)","v":0},null,0,0,null,{"$f":"'ELLE_TATİL_GİR!'!P27","v":0},{"$f":"'ELLE_TATİL_GİR!'!Q27","v":0},{"$f":"'ELLE_TATİL_GİR!'!R27","v":0},null,24,"XXXX","XXXX","XXXX","XXXX","XXXX","XXXX","XXXX","XXXX","XXXX"]
[null,null,null,null,null,null,null,null,25,"2022-02-25",2,"2022-02-25",5,null,null,null,null,null,null,null,null,null,null,1,null,{"$f":"IF(L28=\"\",1,TARİH_GÜN_SEÇİMİ!Y53)","v":0},null,0,0,null,{"$f":"'ELLE_TATİL_GİR!'!P28","v":0},{"$f":"'ELLE_TATİL_GİR!'!Q28","v":0},{"$f":"'ELLE_TATİL_GİR!'!R28","v":0},null,25,"XXXX","XXXX","XXXX","XXXX","XXXX","XXXX","XXXX","XXXX","XXXX"]
[null,null,null,null,null,null,null,null,26,"2022-02-26",2,"2022-02-26",6,null,null,null,null,null,null,null,null,null,null,1,null,{"$f":"IF(L29=\"\",1,TARİH_GÜN_SEÇİMİ!Y54)","v":0},null,1,1,null,{"$f":"'ELLE_TATİL_GİR!'!P29","v":0},{"$f":"'ELLE_TATİL_GİR!'!Q29","v":0},{"$f":"'ELLE_TATİL_GİR!'!R29","v":0},null,26,"XXXX","XXXX","XXXX","XXXX","XXXX","XXXX","XXXX","XXXX","XXXX"]
[null,null,null,null,null,null,null,null,27,"2022-02-27",2,"2022-02-27",7,null,null,null,null,null,null,null,null,null,null,1,null,{"$f":"IF(L30=\"\",1,TARİH_GÜN_SEÇİMİ!Y55)","v":0},null,1,1,null,{"$f":"'ELLE_TATİL_GİR!'!P30","v":0},{"$f":"'ELLE_TATİL_GİR!'!Q30","v":0},{"$f":"'ELLE_TATİL_GİR!'!R30","v":0},null,27,"XXXX","XXXX","XXXX","XXXX","XXXX","XXXX","XXXX","XXXX","XXXX"]
[null,null,null,null,null,null,null,null,28,"2022-02-28",2,"2022-02-28",1,null,null,null,null,null,null,null,null,null,null,1,null,{"$f":"IF(L31=\"\",1,TARİH_GÜN_SEÇİMİ!Y56)","v":0},null,0,0,null,{"$f":"'ELLE_TATİL_GİR!'!P31","v":0},{"$f":"'ELLE_TATİL_GİR!'!Q31","v":0},{"$f":"'ELLE_TATİL_GİR!'!R31","v":0},null,28,"XXXX","XXXX","XXXX","XXXX","XXXX","XXXX","XXXX","XXXX","XXXX"]
[null,null,null,null,null,null,null,null,29,"2022-03-01",3,"","",null,null,null,null,null,null,null,null,null,null,1,null,{"$f":"IF(L32=\"\",1,TARİH_GÜN_SEÇİMİ!Y57)","v":1},null,1,1,null,{"$f":"'ELLE_TATİL_GİR!'!P32","v":0},{"$f":"'ELLE_TATİL_GİR!'!Q32","v":0},{"$f":"'ELLE_TATİL_GİR!'!R32","v":0},null,29,"XXXX","XXXX","XXXX","XXXX","XXXX","XXXX","XXXX","XXXX","XXXX"]
[null,null,null,null,null,null,null,null,30,"2022-03-02",3,"","",null,null,null,null,null,null,null,null,null,null,1,null,{"$f":"IF(L33=\"\",1,TARİH_GÜN_SEÇİMİ!Y58)","v":1},null,1,1,null,{"$f":"'ELLE_TATİL_GİR!'!P33","v":0},{"$f":"'ELLE_TATİL_GİR!'!Q33","v":0},{"$f":"'ELLE_TATİL_GİR!'!R33","v":0},null,30,"XXXX","XXXX","XXXX","XXXX","XXXX","XXXX","XXXX","XXXX","XXXX"]
[null,null,null,null,null,null,null,null,31,"2022-03-03",3,"","",null,null,null,null,null,null,null,null,null,null,1,null,{"$f":"IF(L34=\"\",1,TARİH_GÜN_SEÇİMİ!Y59)","v":1},null,1,1,null,{"$f":"'ELLE_TATİL_GİR!'!P34","v":0},{"$f":"'ELLE_TATİL_GİR!'!Q34","v":0},{"$f":"'ELLE_TATİL_GİR!'!R34","v":0},null,31,"XXXX","XXXX","XXXX","XXXX","XXXX","XXXX","XXXX","XXXX","XXXX"]